{"text_format":"1","workbook":"xlsx","n_sheets":9,"sheets":["REFSTORE","IMPORTFORM","INSTRUCTIONS","Abbrev","J. Am. Chem. Soc.","ScienceDirect","Wiley","Springerlink","RSC"],"not_rendered":{"charts":0,"images":0,"macros":1,"external_links":0,"defined_names":1,"comments":0,"pivot_tables":0},"unopened":[],"bounds":{"document_bytes":16777216,"sheet_cells":100000,"rows_first":2000,"rows_last":500,"rows_between":2000,"halvings":0,"cell_chars":16384,"cell_head_chars":4096},"cells_cut":0,"cells_raw":0,"read":"whole","date_system":"1904"}

{"sheet":"REFSTORE","index":0,"n_rows":16109,"n_cols":13,"rows_kept":16109,"cut":false,"hidden":true,"merged":[[1,5,2,5]]}
[]
[null,null,null,null,null,"RefStore"]
[]
[]
[null,null,"ID","DATE","AUTHOR","JOURNAL","YEAR","VOLUME (No)","DOI","PAGE","Website","WIKI","Formated"]
[null,null,1]
[null,null,2]
[null,null,3]
[null,null,4]
[null,null,5]
[null,null,6]
[null,null,7]
[null,null,8]
[null,null,9]
[null,null,10]
[null,null,11]
[null,null,12]
[null,null,13]
[null,null,14]
[null,null,15]
{"$rows_left_out":16090}
{"sheet":"IMPORTFORM","index":1,"n_rows":16,"n_cols":10,"rows_kept":16,"cut":false,"hidden":false,"merged":[[6,0,8,0],[6,1,8,1]]}
[]
[]
["WEBSITE","IMPORT METHOD"]
["http://pubs.acs.org/journal/jacsat","DIRECT COPY"]
["http://www.sciencedirect.com/","BIBTEX; COPY JOURNAL TO AUTHOR"]
["http://onlinelibrary.wiley.com","BIBTEX; COPY ALL"]
["http://www.springerlink.com/","COPY JOURNAL AND DETAILS, STORE, COPY AUTHORS, STORE, CLICK YEAR + IMPORT"]
[]
[]
["http://pubs.rsc.org/","COPY AUTHORS, JOURNAL DETAILS AND DOI, UP TO (BUT NOT INCLUDING) THE COMMA"]
[]
[null,null,null,null,null,null,null,null,"Type to Edit"]
[null,null,null,null,null,null,"LAST IMPORT ID",null,"FONT STYLE","FONT SIZE"]
["IMPERIAL REFERENCE STYLE",null,null,"STORING IMPORTED REFERENCES ON?","YES",null,0,null,"TIMES",10]
[]
["Wiki <ref> code"]

{"sheet":"INSTRUCTIONS","index":2,"n_rows":62,"n_cols":7,"rows_kept":62,"cut":false,"hidden":true,"merged":[]}
[]
[]
[]
[null,"What does this program do?",null,null,"The program takes the information imported into it (about the authors, journals, etc ) and orders and formats it into the \"Imperial\" Referencing Style and a wiki ref output."]
[null,"Why all the buttons?",null,null,"Because each website provides the required information in a different way, a different model is used to format data from each website."]
[null,"What can it Import?",null,null,"The program can only format/extract based on what it expects. Therefore, it only works if the instructions are clearly followed"]
[null,null,null,null,"The program does not think. It has a few safety catches, but can easily be fooled by poor inputs. For example, copying a picture and pressing import is not a good idea..."]
[null,null,null,null,"The program cannot currently import anything except journals from the given websites. It is not an all inclusive referencing package."]
[null,"It's Not Working!",null,null,"If an import does not import/format the information properly, you can report the error (by leaving the DOI) on the Imperial Wiki page for this program and I may fix it."]
[null,null,null,null,"Of course, you might not be following the instructions. Then it's probably your fault."]
[]
[null,"The Clear Clipboard Button:",null,null,"Excel is odd. If something has been copied in excel and not cleared, it overrides other copied data and decides to paste its own clipboard."]
[null,null,null,null,"Press Clear Clipboard after copying formatted data, before importing a new reference."]
[null,null,null,null,"Those flashing lines around the cell will disappear and you might actually get an import to work."]
[]
[null,"RESET  - PRESS IF ERROR OCCURS:  Button",null,null,null,null,"Sometimes the wrong thing is pasted. Sometimes this tricks the program into doing bad things. Press reset if things look bad and it may fix something,"]
[null,null,null,null,null,null,"It might not. (Pressing this button will not clear the RefStore)"]
[]
[null,"User Specified Fonts etc",null,null,"You can set your own font style and size via the excel menus"]
[]
{"$rows_left_out":43}
{"sheet":"Abbrev","index":3,"n_rows":8,"n_cols":3,"rows_kept":8,"cut":false,"hidden":true,"merged":[]}
[]
[null,"COMING SOON"]
["ID","JOURNAL","Abbrev."]
[null,"Chemical Physics Letters","Chem. Phys. Lett."]
[null,"Journal of Trace Elements in Medicine and Biology","J. of Trace Elements in Med. And Bio."]
[null,"Tetrahedron Letters","Tet. Lett."]
[null,"Journal of Solid State Chemistry","J. Solid State Chem."]
[null,"Nuclear Instruments and Methods in Physics Research Section A: Accelerators, Spectrometers, Detectors and Associated Equipment","Nuc. Instr. And Methods"]

{"sheet":"J. Am. Chem. Soc.","index":4,"n_rows":29,"n_cols":103,"rows_kept":29,"cut":false,"hidden":true,"merged":[]}
[]
[null,null,null,null,null,null,null,"ID","DATE","AUTHOR","JOURNAL","YEAR","VOLUME (No)","DOI","PAGE","IMPORT","WIKI","FORMATTED"]
[null,null,null,null,null,null,"EXPORT",null,{"$f":"TODAY()","v":"2011-03-18"},{"$f":"B4","v":0},{"$f":"B10","v":"*"},{"$f":"C10","v":"*"},{"$f":"D10","v":"*"},{"$f":"B6","v":0},{"$f":"F10","v":"*"},"JACS",{"$f":"B29","v":"<ref name=\"NAMEHERE\">''*'',*,'''*''', * {{DOI|*}}</ref>"},"*. *. *. *. *. *. *. *. *. *. *. *. *. *. *. *. *. *. *. *. *. *. *. *. *. *. *. *. *. *. *. *. *. *. *. *. *. *. *. *. *. *. *. *. *. *. *. *. *. *. *. *. *. *. *. *. *. *. *. *. *. *. *. *. *. *. *. *. *. *. *. *. *. *. *. *. *. *. *. *. *. *. *. *. *. *. *. *. *. *. *. *. *. *. *. *. *. *. *. *. *. *. *,*,*, *"]
["AUTHORS",null,null,null,null,null,"RE-EXPORT",{"$f":"REFSTORE!G2","v":0},{"$f":"VLOOKUP('J. Am. Chem. Soc.'!$H$4,REFSTORE!$C$6:$K$50000,2)","v":{"$error":"#N/A"}},{"$f":"VLOOKUP('J. Am. Chem. Soc.'!$H$4,REFSTORE!$C$6:$K$50000,3)","v":{"$error":"#N/A"}},{"$f":"VLOOKUP('J. Am. Chem. Soc.'!$H$4,REFSTORE!$C$6:$K$50000,4)","v":{"$error":"#N/A"}},{"$f":"VLOOKUP('J. Am. Chem. Soc.'!$H$4,REFSTORE!$C$6:$K$50000,5)","v":{"$error":"#N/A"}},{"$f":"VLOOKUP('J. Am. Chem. Soc.'!$H$4,REFSTORE!$C$6:$K$50000,6)","v":{"$error":"#N/A"}},{"$f":"VLOOKUP('J. Am. Chem. Soc.'!$H$4,REFSTORE!$C$6:$K$50000,7)","v":{"$error":"#N/A"}},{"$f":"VLOOKUP('J. Am. Chem. Soc.'!$H$4,REFSTORE!$C$6:$K$50000,8)","v":{"$error":"#N/A"}},{"$f":"VLOOKUP('J. Am. Chem. Soc.'!$H$4,REFSTORE!$C$6:$K$50000,9)","v":{"$error":"#N/A"}},"CONC",{"$f":"J4&\", \"&K4&\", \"&L4&\", \"&M4&\", \"&O4","v":{"$error":"#N/A"}}]
["JOURNAL",null,null,null,null,null,null,null,null,null,null,null,null,null,null,null,"WIKI",{"$f":"\"<ref name=\"\"NAMEHERE\"\">\"&J4&\", ''\"&K4&\"'', \"&L4&\", '''\"&M4&\"''', \"&O4&\" {{DOI|\"&N4&\"}}</ref>\"","v":{"$error":"#N/A"}}]
["CHECK DOI"]
[{"$f":"IF(myextract(B7,1,\"F\",\" \")=\"DOI:\",\"NOT OK\",\"OK\")","v":"OK"}]
[{"$f":"IF(myextract(B8,1,\"F\",\" \")=\"DOI:\",\"NOT OK\",\"OK\")","v":"OK"}]
[{"$f":"IF(myextract(B9,1,\"F\",\" \")=\"DOI:\",\"NOT OK\",\"OK\")","v":"OK"},null,"Year","Vol (no)","p/pp page","page","together",null,null,null,"DOI:"]
["Journal",{"$f":"myextract($B$5,1,\"F\",\",\")","v":"*"},{"$f":"myextract($B$5,2,\"F\",\",\")","v":"*"},{"$f":"myextract($B$5,3,\"F\",\",\")","v":"*"},{"$f":"((myextract($B$5,4,\"F\",\",\")))","v":"*"},{"$f":"IF(E11=\"pp\",(myextract(E10,2,\"F\",\"–\")),myextract(E10,1,\"B\",\" \"))","v":"*"},{"$f":"B10&\",\"&C10&\",\"&D10&\", \"&F10","v":"*,*,*, *"},null,null,null,{"$f":"myextract(B6,2,\"F\",\" \")","v":"*"}]
["len journal",{"$f":"LEN(B10)","v":1},null,"p or pp?",{"$f":"MID(myextract(E10,1,\"F\",\" \"),2,4)","v":""}]
[]
[]
["Authors",{"$f":"B4","v":0}]
["plus comma",{"$f":"B14&\",\"","v":"0,"},{"$f":"LEN(B10)+LEN(C10)","v":2}]
["Len string",{"$f":"LEN(B15)","v":2}]
["Count Term",1,2,3,4,5,6,7,8,9,10,11,12,13,14,15,16,17,18,19,20,21,22,23,24,25,26,27,28,29,30,31,32,33,34,35,36,37,38,39,40,41,42,43,44,45,46,47,48,49,50,51,52,53,54,55,56,57,58,59,60,61,62,63,64,65,66,67,68,69,70,71,72,73,74,75,76,77,78,79,80,81,82,83,84,85,86,87,88,89,90,91,92,93,94,95,96,97,98,99,100,101,102]
["Split Words",{"$f":"myextract($B$15,B17,\"F\",\" \")","v":"*"},{"$f":"myextract($B$15,C17,\"F\",\" \")","v":"*"},"*","*","*","*","*","*","*","*","*","*","*","*","*","*","*","*","*","*","*","*","*","*","*","*","*","*","*","*","*","*",{"$f":"myextract($B$15,AH17,\"F\",\" \")","v":"*"},"*","*","*","*","*","*","*","*","*","*","*","*","*","*","*","*","*","*","*","*","*","*","*","*","*","*","*","*","*","*","*",{"$f":"myextract($B$15,BN17,\"F\",\" \")","v":"*"},"*","*","*","*","*","*","*","*","*","*","*","*","*","*","*","*","*","*","*","*","*","*","*","*","*","*","*","*","*","*","*",{"$f":"myextract($B$15,CT17,\"F\",\" \")","v":"*"},"*","*","*","*","*"]
["Initialise",{"$f":"IF(RIGHT(B18,1)=\",\",B18,(LEFT(B18,1))&\".\")","v":"*."},{"$f":"IF(RIGHT(C18,1)=\",\",C18,(LEFT(C18,1))&\".\")","v":"*."},"*.","*.","*.","*.","*.","*.","*.","*.","*.","*.","*.","*.","*.","*.","*.","*.",{"$f":"IF(RIGHT(T18,1)=\",\",T18,(LEFT(T18,1))&\".\")","v":"*."},"*.","*.","*.","*.","*.","*.","*.","*.","*.","*.","*.","*.","*.","*.","*.","*.","*.","*.","*.","*.","*.","*.","*.","*.","*.","*.","*.","*.","*.","*.","*.",{"$f":"IF(RIGHT(AZ18,1)=\",\",AZ18,(LEFT(AZ18,1))&\".\")","v":"*."},"*.","*.","*.","*.","*.","*.","*.","*.","*.","*.","*.","*.","*.","*.","*.","*.","*.","*.","*.","*.","*.","*.","*.","*.","*.","*.","*.","*.","*.","*.","*.",{"$f":"IF(RIGHT(CF18,1)=\",\",CF18,(LEFT(CF18,1))&\".\")","v":"*."},"*.","*.","*.","*.","*.","*.","*.","*.","*.","*.","*.","*.","*.","*.","*.","*.","*.","*.","*."]
["Len",{"$f":"LEN(B19)","v":2},{"$f":"LEN(C19)","v":2},2,2,2,2,2,2,2,2,2,2,2,2,2,2,2,2,{"$f":"LEN(T19)","v":2},2,2,2,2,2,2,2,2,2,2,2,2,2,2,2,2,2,2,2,2,2,2,2,2,2,2,2,2,2,2,2,{"$f":"LEN(AZ19)","v":2},2,2,2,2,2,2,2,2,2,2,2,2,2,2,2,2,2,2,2,2,2,2,2,2,2,2,2,2,2,2,2,{"$f":"LEN(CF19)","v":2},2,2,2,2,2,2,2,2,2,2,2,2,2,2,2,2,2,2,2]
{"$rows_left_out":10}
{"sheet":"ScienceDirect","index":5,"n_rows":78,"n_cols":140,"rows_kept":78,"cut":false,"hidden":true,"merged":[]}
["CHECK"]
["(1 FOR WRONG)",null,null,"Check","Check"]
[{"$f":"SUM(A4:A22)","v":10},"IMPORT","<ref name=\"Advances In Platinum Chemotherapeutics\">B. Harper, A. Krause-Heuer, M. Grant, M. Manohar, K. B. Garbutcheon-Singh, J. Aldrich-Wright, ''Chemistry – A European Journal'', 2010, '''16 (24)''', 7064 {{DOI|10.1002/chem.201000148}}</ref>",{"$f":"SUM(D4:D13)","v":{"$error":"#VALUE!"}},{"$f":"SUM(E4:E13)","v":{"$error":"#VALUE!"}}]
[{"$f":"IF(myextract(B4,1,\"F\",\" \")=\"journal\",0,1)","v":1},null,null,{"$f":"IF(myextract(C3,1,\"F\",\" \")=\"journal\",0,1)","v":1},{"$f":"IF(myextract(D4,1,\"F\",\" \")=\"journal\",0,1)","v":1},null,null,"ID","DATE","AUTHOR","JOURNAL","YEAR","VOLUME (No)","DOI","PAGE","IMPORT","WIKI"]
[null,null,null,{"$f":"IF(myextract(#REF!,1,\"F\",\" \")=\"VOLUME\",0,1)","v":{"$error":"#VALUE!"}},{"$f":"IF(myextract(D5,1,\"F\",\" \")=\"VOLUME\",0,1)","v":{"$error":"#VALUE!"}},null,null,null,{"$f":"TODAY()","v":"2011-03-18"},{"$f":"L53","v":""},{"$f":"L28","v":"*"},{"$f":"L36","v":"*"},{"$f":"N32","v":"* (*)"},{"$f":"L42","v":"*"},{"$f":"M34","v":"*"},"SD",{"$f":"L60","v":"<ref name=\"NAMEHERE\">, ''*'', *, '''* (*)''', * {{DOI|*}}</ref>"},"X. Liu, K. Surowiec, R. A. Bartsch, Tetrahedron, 2009, 65 (31), 5893"]
[{"$f":"IF(myextract(B6,1,\"F\",\" \")=\"VOLUME\",0,1)","v":1},null,null,{"$f":"IF(myextract(#REF!,1,\"F\",\" \")=\"NUMBER\",0,1)","v":{"$error":"#VALUE!"}},{"$f":"IF(myextract(D6,1,\"F\",\" \")=\"NUMBER\",0,1)","v":{"$error":"#VALUE!"}},null,null,"RE-EXPORT",{"$f":"REFSTORE!G2","v":0},{"$f":"VLOOKUP('J. Am. Chem. Soc.'!$H$4,REFSTORE!$C$6:$K$50000,2)","v":{"$error":"#N/A"}},{"$f":"VLOOKUP('J. Am. Chem. Soc.'!$H$4,REFSTORE!$C$6:$K$50000,3)","v":{"$error":"#N/A"}},{"$f":"VLOOKUP('J. Am. Chem. Soc.'!$H$4,REFSTORE!$C$6:$K$50000,4)","v":{"$error":"#N/A"}},{"$f":"VLOOKUP('J. Am. Chem. Soc.'!$H$4,REFSTORE!$C$6:$K$50000,5)","v":{"$error":"#N/A"}},{"$f":"VLOOKUP('J. Am. Chem. Soc.'!$H$4,REFSTORE!$C$6:$K$50000,6)","v":{"$error":"#N/A"}},{"$f":"VLOOKUP('J. Am. Chem. Soc.'!$H$4,REFSTORE!$C$6:$K$50000,7)","v":{"$error":"#N/A"}},{"$f":"VLOOKUP('J. Am. Chem. Soc.'!$H$4,REFSTORE!$C$6:$K$50000,8)","v":{"$error":"#N/A"}},{"$f":"VLOOKUP('J. Am. Chem. Soc.'!$H$4,REFSTORE!$C$6:$K$50000,9)","v":{"$error":"#N/A"}},"CONC",{"$f":"K6&\", \"&L6&\", \"&M6&\", \"&N6&\", \"&P6","v":{"$error":"#N/A"}}]
[null,null,null,{"$f":"IF(myextract(C7,1,\"F\",\" \")=\"PAGES\",0,1)","v":1},{"$f":"IF(myextract(D7,1,\"F\",\" \")=\"PAGES\",0,1)","v":1},null,null,null,null,null,null,null,null,null,null,null,null,"WIKI",{"$f":"\"<ref name=\"\"NAMEHERE\"\">\"&K6&\", ''\"&L6&\"'', \"&M6&\", '''\"&N6&\"''', \"&P6&\" {{DOI|\"&O6&\"}}</ref>\"","v":{"$error":"#N/A"}}]
[{"$f":"IF(myextract(B8,1,\"F\",\" \")=\"NUMBER\",0,1)","v":1},null,null,{"$f":"IF(myextract(C8,1,\"F\",\" \")=\"YEAR\",0,1)","v":1},{"$f":"IF(myextract(D8,1,\"F\",\" \")=\"YEAR\",0,1)","v":1}]
[null,null,null,{"$f":"IF(myextract(C9,1,\"F\",\" \")=\"NOTE\",0,1)","v":1},{"$f":"IF(myextract(D9,1,\"F\",\" \")=\"NOTE\",0,1)","v":1}]
[{"$f":"IF(myextract(B10,1,\"F\",\" \")=\"PAGES\",0,1)","v":1},null,null,{"$f":"IF(myextract(C10,1,\"F\",\" \")=\"ISSN\",0,1)","v":1},{"$f":"IF(myextract(D10,1,\"F\",\" \")=\"ISSN\",0,1)","v":1}]
[null,null,null,{"$f":"IF(myextract(C11,1,\"F\",\" \")=\"DOI\",0,1)","v":1},{"$f":"IF(myextract(D11,1,\"F\",\" \")=\"DOI\",0,1)","v":1}]
[{"$f":"IF(myextract(B12,1,\"F\",\" \")=\"YEAR\",0,1)","v":1},null,null,{"$f":"IF(myextract(C12,1,\"F\",\" \")=\"URL\",0,1)","v":1},{"$f":"IF(myextract(D12,1,\"F\",\" \")=\"URL\",0,1)","v":1}]
[null,null,null,{"$f":"IF(myextract(C13,1,\"F\",\" \")=\"AUTHOR\",0,1)","v":1},{"$f":"IF(myextract(D13,1,\"F\",\" \")=\"AUTHOR\",0,1)","v":1}]
[{"$f":"IF(myextract(B14,1,\"F\",\" \")=\"NOTE\",0,1)","v":1}]
[]
[{"$f":"IF(myextract(B16,1,\"F\",\" \")=\"ISSN\",0,1)","v":1}]
[]
[{"$f":"IF(myextract(B18,1,\"F\",\" \")=\"DOI\",0,1)","v":1}]
[]
[{"$f":"IF(myextract(B20,1,\"F\",\" \")=\"URL\",0,1)","v":1}]
{"$rows_left_out":59}
{"sheet":"Wiley","index":6,"n_rows":45,"n_cols":138,"rows_kept":45,"cut":false,"hidden":true,"merged":[]}
[]
["ID","DATE","AUTHOR","JOURNAL","YEAR","VOLUME (No)","DOI","PAGE","IMPORT","wiki"]
[null,{"$f":"TODAY()","v":"2011-03-18"},{"$f":"J38","v":"B. Harper, A. Krause-Heuer, M. Grant, M. Manohar, K. B. Garbutcheon-Singh, J. Aldrich-Wright, "},{"$f":"J18","v":{"$error":"#VALUE!"}},{"$f":"J26","v":"YEAR ERROR"},{"$f":"K19","v":{"$error":"#VALUE!"}},{"$f":"J24","v":{"$error":"#VALUE!"}},{"$f":"K25","v":{"$error":"#VALUE!"}},"Wiley",{"$f":"J45","v":{"$error":"#VALUE!"}}]
["RE-EXPORT",{"$f":"REFSTORE!G2","v":0},{"$f":"VLOOKUP('J. Am. Chem. Soc.'!$H$4,REFSTORE!$C$6:$K$50000,2)","v":{"$error":"#N/A"}},{"$f":"VLOOKUP('J. Am. Chem. Soc.'!$H$4,REFSTORE!$C$6:$K$50000,3)","v":{"$error":"#N/A"}},{"$f":"VLOOKUP('J. Am. Chem. Soc.'!$H$4,REFSTORE!$C$6:$K$50000,4)","v":{"$error":"#N/A"}},{"$f":"VLOOKUP('J. Am. Chem. Soc.'!$H$4,REFSTORE!$C$6:$K$50000,5)","v":{"$error":"#N/A"}},{"$f":"VLOOKUP('J. Am. Chem. Soc.'!$H$4,REFSTORE!$C$6:$K$50000,6)","v":{"$error":"#N/A"}},{"$f":"VLOOKUP('J. Am. Chem. Soc.'!$H$4,REFSTORE!$C$6:$K$50000,7)","v":{"$error":"#N/A"}},{"$f":"VLOOKUP('J. Am. Chem. Soc.'!$H$4,REFSTORE!$C$6:$K$50000,8)","v":{"$error":"#N/A"}},{"$f":"VLOOKUP('J. Am. Chem. Soc.'!$H$4,REFSTORE!$C$6:$K$50000,9)","v":{"$error":"#N/A"}},"CONC",{"$f":"D4&\", \"&E4&\", \"&F4&\", \"&G4&\", \"&I4","v":{"$error":"#N/A"}}]
[null,null,null,null,null,null,null,null,null,null,"WIKI",{"$f":"\"<ref name=\"\"NAMEHERE\"\">\"&D4&\", ''\"&E4&\"'', \"&F4&\", '''\"&G4&\"''', \"&I4&\" {{DOI|\"&H4&\"}}</ref>\"","v":{"$error":"#N/A"}}]
[]
[]
[]
[]
[]
[]
[]
[]
["CHECK"]
[{"$f":"SUM(A16:A27)","v":12}]
[{"$f":"IF(myextract(B16,1,\"F\",\" \")=\"AUTHOR\",0,1)","v":1},null,null,null,null,null,null,null,null,{"$f":"PROPER(MID((myextract(B16, 2, \"F\", \"{\")), 1, LEN(B16) - 12))","v":{"$error":"#VALUE!"}}]
[{"$f":"IF(myextract(B17,1,\"F\",\" \")=\"TITLE\",0,1)","v":1},null,null,null,null,null,null,null,null,{"$f":"PROPER(MID((myextract(B17,2,\"F\",\"{\")),1,LEN(B17)-11))","v":{"$error":"#VALUE!"}}]
[{"$f":"IF(myextract(B18,1,\"F\",\" \")=\"JOURNAL\",0,1)","v":1},null,null,null,null,null,null,null,null,{"$f":"MID(B18,12,LEN(B18)-13)","v":{"$error":"#VALUE!"}},{"$f":"LEN(J18)+1","v":{"$error":"#VALUE!"}}]
[{"$f":"IF(myextract(B19,1,\"F\",\" \")=\"VOLUME\",0,1)","v":1},null,null,null,null,null,null,null,null,{"$f":"MID(B19,11,LEN(B19)-12)","v":{"$error":"#VALUE!"}},{"$f":"J19&\" (\"&J20&\")\"","v":{"$error":"#VALUE!"}}]
[{"$f":"IF(myextract(B20,1,\"F\",\" \")=\"NUMBER\",0,1)","v":1},null,null,null,null,null,null,null,null,{"$f":"MID(B20,11,LEN(B20)-12)","v":{"$error":"#VALUE!"}}]
{"$rows_left_out":26}
{"sheet":"Springerlink","index":7,"n_rows":39,"n_cols":103,"rows_kept":39,"cut":false,"hidden":true,"merged":[]}
[]
[]
[null,null,null,null,null,null,null,"READY?","sum of 2"]
["AUTHORS",null,null,null,null,null,null,{"$f":"IF(B4<>\"\",1,0)","v":0},{"$f":"H4+H5","v":0}]
["JOURNAL",null,null,null,null,null,null,{"$f":"IF(B5<>\"\",1,0)","v":0},{"$f":"H5+H6","v":0}]
["data",null,null,null,null,null,null,{"$f":"IF(B6<>\"\",1,0)","v":0},{"$f":"H6+H7","v":0}]
["year",null,null,null,null,null,null,{"$f":"IF(B7<>\"\",1,0)","v":0}]
[]
[null,"Journal","Year","Vol (no)","p/pp page","page","together",null,null,null,"DOI:"]
["Journal",{"$f":"B5","v":0},{"$f":"B7","v":0},{"$f":"IF(F12=\"R\",(MID(B6,8,(D11-8))&\" (\"&E12&\")\"),(MID(B6,8,(D11-8))&\" (\"&E13&\")\"))","v":{"$error":"#VALUE!"}},{"$f":"myextract(B6,3,\"F\",\",\")","v":"*"},{"$f":"MID(E10,2,FIND(\"-\",E10)-2)","v":{"$error":"#VALUE!"}},{"$f":"B10&\", \"&C10&\", \"&D10&\", \"&F10","v":{"$error":"#VALUE!"}},null,null,null,{"$f":"myextract(B6,1,\"B\",\" \")","v":"*"}]
["len journal",{"$f":"LEN(B10)","v":1},"find",{"$f":"FIND(\",\",B6)","v":{"$error":"#VALUE!"}},"NO","r OR S?"]
[null,null,"find",{"$f":"FIND(\",\",B6,D11+1)","v":{"$error":"#VALUE!"}},{"$f":"MID(B6,D11+9,D12-D11-9)","v":{"$error":"#VALUE!"}},{"$f":"MID(B6,D11+7,D12-D11-9)","v":{"$error":"#VALUE!"}}]
[null,null,null,"No Space",{"$f":"MID(E12,2,LEN(E12)-1)","v":{"$error":"#VALUE!"}}]
["Authors",{"$f":"B4","v":0}]
["plus comma",{"$f":"B14&\",\"","v":"0,"},{"$f":"LEN(B10)+LEN(C10)+2","v":4}]
["Len string",{"$f":"LEN(B15)","v":2}]
["Count Term",1,2,3,4,5,6,7,8,9,10,11,12,13,14,15,16,17,18,19,20,21,22,23,24,25,26,27,28,29,30,31,32,33,34,35,36,37,38,39,40,41,42,43,44,45,46,47,48,49,50,51,52,53,54,55,56,57,58,59,60,61,62,63,64,65,66,67,68,69,70,71,72,73,74,75,76,77,78,79,80,81,82,83,84,85,86,87,88,89,90,91,92,93,94,95,96,97,98,99,100,101,102]
["Split Words",{"$f":"myextract($B$15,B17,\"F\",\" \")","v":"*"},{"$f":"myextract($B$15,C17,\"F\",\" \")","v":"*"},"*","*","*","*","*","*","*","*","*","*","*","*","*","*","*","*","*","*","*","*","*","*","*","*","*","*","*","*","*","*","*","*","*","*","*","*","*","*","*","*","*","*","*","*","*","*","*","*","*","*","*","*","*","*","*","*","*","*","*","*","*","*","*",{"$f":"myextract($B$15,BO17,\"F\",\" \")","v":"*"},"*","*","*","*","*","*","*","*","*","*","*","*","*","*","*","*","*","*","*","*","*","*","*","*","*","*","*","*","*","*","*","*","*","*","*","*"]
["Initialise",{"$f":"IF(RIGHT(B18,1)=\",\",B18,(LEFT(B18,1))&\".\")","v":"*."},{"$f":"IF(RIGHT(C18,1)=\",\",C18,(LEFT(C18,1))&\".\")","v":"*."},"*.","*.","*.","*.","*.","*.","*.","*.","*.","*.","*.","*.","*.","*.","*.","*.","*.","*.","*.","*.","*.","*.","*.","*.","*.","*.","*.","*.","*.","*.","*.","*.","*.","*.","*.","*.","*.","*.","*.","*.","*.","*.","*.","*.","*.","*.","*.","*.","*.","*.","*.","*.","*.","*.","*.","*.","*.","*.","*.","*.","*.","*.",{"$f":"IF(RIGHT(BN18,1)=\",\",BN18,(LEFT(BN18,1))&\".\")","v":"*."},"*.","*.","*.","*.","*.","*.","*.","*.","*.","*.","*.","*.","*.","*.","*.","*.","*.","*.","*.","*.","*.","*.","*.","*.","*.","*.","*.","*.","*.","*.","*.","*.","*.","*.","*.","*.","*."]
["Len",{"$f":"LEN(B19)","v":2},{"$f":"LEN(C19)","v":2},2,2,2,2,2,2,2,2,2,2,2,2,2,2,2,2,2,2,2,2,2,2,2,2,2,2,2,2,2,2,2,2,2,2,2,2,2,2,2,2,2,2,2,2,2,2,2,2,2,2,2,2,2,2,2,2,2,2,2,2,2,2,2,{"$f":"LEN(BO19)","v":2},2,2,2,2,2,2,2,2,2,2,2,2,2,2,2,2,2,2,2,2,2,2,2,2,2,2,2,2,2,2,2,2,2,2,2,2]
{"$rows_left_out":20}
{"sheet":"RSC","index":8,"n_rows":29,"n_cols":103,"rows_kept":29,"cut":false,"hidden":true,"merged":[]}
[]
[null,null,null,null,null,null,null,"ID","DATE","AUTHOR","JOURNAL","YEAR","VOLUME (No)","DOI","PAGE","IMPORT","WIKI","FORMATTED"]
[null,null,null,null,null,null,"EXPORT",null,{"$f":"TODAY()","v":"2011-03-18"},{"$f":"B4","v":0},{"$f":"B10","v":"*"},{"$f":"C10","v":"*"},{"$f":"D10","v":"*"},{"$f":"B6","v":0},{"$f":"F10","v":""},"RSC",{"$f":"B29","v":"<ref name=\"NAMEHERE\">''*'',*,''' ''',  {{DOI|*}}</ref>"},"*. *. *. *. *. *. *. *. *. *. *. *. *. *. *. *. *. *. *. *. *. *. *. *. *. *. *. *. *. *. *. *. *. *. *. *. *. *. *. *. *. *. *. *. *. *. *. *. *. *. *. *. *. *. *. *. *. *. *. *. *. *. *. *. *. *. *. *. *. *. *. *. *. *. *. *. *. *. *. *. *. *. *. *. *. *. *. *. *. *. *. *. *. *. *. *. *. *. *. *. *. *. *,*,*, *"]
["AUTHORS",null,null,null,null,null,"RE-EXPORT",{"$f":"REFSTORE!G2","v":0},{"$f":"VLOOKUP('J. Am. Chem. Soc.'!$H$4,REFSTORE!$C$6:$K$50000,2)","v":{"$error":"#N/A"}},{"$f":"VLOOKUP('J. Am. Chem. Soc.'!$H$4,REFSTORE!$C$6:$K$50000,3)","v":{"$error":"#N/A"}},{"$f":"VLOOKUP('J. Am. Chem. Soc.'!$H$4,REFSTORE!$C$6:$K$50000,4)","v":{"$error":"#N/A"}},{"$f":"VLOOKUP('J. Am. Chem. Soc.'!$H$4,REFSTORE!$C$6:$K$50000,5)","v":{"$error":"#N/A"}},{"$f":"VLOOKUP('J. Am. Chem. Soc.'!$H$4,REFSTORE!$C$6:$K$50000,6)","v":{"$error":"#N/A"}},{"$f":"VLOOKUP('J. Am. Chem. Soc.'!$H$4,REFSTORE!$C$6:$K$50000,7)","v":{"$error":"#N/A"}},{"$f":"VLOOKUP('J. Am. Chem. Soc.'!$H$4,REFSTORE!$C$6:$K$50000,8)","v":{"$error":"#N/A"}},{"$f":"VLOOKUP('J. Am. Chem. Soc.'!$H$4,REFSTORE!$C$6:$K$50000,9)","v":{"$error":"#N/A"}},"CONC",{"$f":"J4&\", \"&K4&\", \"&L4&\", \"&M4&\", \"&O4","v":{"$error":"#N/A"}}]
["JOURNAL",null,null,null,null,null,null,null,null,null,null,null,null,null,null,null,"WIKI",{"$f":"\"<ref name=\"\"NAMEHERE\"\">\"&J4&\", ''\"&K4&\"'', \"&L4&\", '''\"&M4&\"''', \"&O4&\" {{DOI|\"&N4&\"}}</ref>\"","v":{"$error":"#N/A"}}]
["CHECK DOI"]
[{"$f":"IF(myextract(B7,1,\"F\",\" \")=\"DOI:\",\"NOT OK\",\"OK\")","v":"OK"}]
[{"$f":"IF(myextract(B8,1,\"F\",\" \")=\"DOI:\",\"NOT OK\",\"OK\")","v":"OK"}]
[{"$f":"IF(myextract(B9,1,\"F\",\" \")=\"DOI:\",\"NOT OK\",\"OK\")","v":"OK"},null,"Year","Vol (no)","p/pp page","page","together",null,null,null,"DOI:"]
["Journal",{"$f":"myextract($B$5,1,\"F\",\",\")","v":"*"},{"$f":"myextract($B$5,2,\"F\",\",\")","v":"*"},{"$f":"myextract($B$5,3,\"F\",\",\")","v":"*"},{"$f":"((myextract($B$5,1,\"B\",\",\")))","v":"*"},{"$f":"E11","v":""},{"$f":"B10&\",\"&C10&\",\"&IF(E12=\"vol\",D10,H12)&\", \"&F10","v":"*,*, , "},null,null,null,{"$f":"myextract(B6,2,\"F\",\" \")","v":"*"}]
["len journal",{"$f":"LEN(B10)","v":1},null,"PAGE",{"$f":"MID(myextract(E10,1,\"F\",\"-\"),2,8)","v":""}]
[null,null,"Check if Vol",{"$f":"MID(myextract(B5,3,\"F\",\",\"),1,20)","v":"*"},{"$f":"IF(D12=E10,\"NO vol\",\"vol\")","v":"NO vol"},"INPUT VOL",null,{"$f":"\" \"&G12","v":" "}]
[]
["Authors",{"$f":"B4","v":0}]
["plus comma",{"$f":"B14&\",\"","v":"0,"},{"$f":"LEN(B10)+LEN(C10)","v":2}]
["Len string",{"$f":"LEN(B15)","v":2}]
["Count Term",1,2,3,4,5,6,7,8,9,10,11,12,13,14,15,16,17,18,19,20,21,22,23,24,25,26,27,28,29,30,31,32,33,34,35,36,37,38,39,40,41,42,43,44,45,46,47,48,49,50,51,52,53,54,55,56,57,58,59,60,61,62,63,64,65,66,67,68,69,70,71,72,73,74,75,76,77,78,79,80,81,82,83,84,85,86,87,88,89,90,91,92,93,94,95,96,97,98,99,100,101,102]
["Split Words",{"$f":"myextract($B$15,B17,\"F\",\" \")","v":"*"},{"$f":"myextract($B$15,C17,\"F\",\" \")","v":"*"},"*","*","*","*","*","*","*","*","*","*","*","*","*","*","*","*","*","*","*","*","*","*","*","*","*","*","*","*","*","*","*","*","*","*","*","*","*","*","*","*","*","*","*","*","*","*","*","*","*","*","*","*","*","*","*","*","*","*","*","*","*","*","*",{"$f":"myextract($B$15,BO17,\"F\",\" \")","v":"*"},"*","*","*","*","*","*","*","*","*","*","*","*","*","*","*","*","*","*","*","*","*","*","*","*","*","*","*","*","*","*","*","*","*","*","*","*"]
["Initialise",{"$f":"IF(RIGHT(B18,1)=\",\",B18,(LEFT(B18,1))&\".\")","v":"*."},{"$f":"IF(RIGHT(C18,1)=\",\",C18,(LEFT(C18,1))&\".\")","v":"*."},"*.","*.","*.","*.","*.","*.","*.","*.","*.","*.","*.","*.","*.","*.","*.","*.","*.","*.","*.","*.","*.","*.","*.","*.","*.","*.","*.","*.","*.","*.","*.","*.","*.","*.","*.","*.","*.","*.","*.","*.","*.","*.","*.","*.","*.","*.","*.","*.","*.","*.","*.","*.","*.","*.","*.","*.","*.","*.","*.","*.","*.","*.",{"$f":"IF(RIGHT(BN18,1)=\",\",BN18,(LEFT(BN18,1))&\".\")","v":"*."},"*.","*.","*.","*.","*.","*.","*.","*.","*.","*.","*.","*.","*.","*.","*.","*.","*.","*.","*.","*.","*.","*.","*.","*.","*.","*.","*.","*.","*.","*.","*.","*.","*.","*.","*.","*.","*."]
["Len",{"$f":"LEN(B19)","v":2},{"$f":"LEN(C19)","v":2},2,2,2,2,2,2,2,2,2,2,2,2,2,2,2,2,2,2,2,2,2,2,2,2,2,2,2,2,2,2,2,2,2,2,2,2,2,2,2,2,2,2,2,2,2,2,2,2,2,2,2,2,2,2,2,2,2,2,2,2,2,2,2,{"$f":"LEN(BO19)","v":2},2,2,2,2,2,2,2,2,2,2,2,2,2,2,2,2,2,2,2,2,2,2,2,2,2,2,2,2,2,2,2,2,2,2,2,2]
{"$rows_left_out":9}