{"text_format":"1","workbook":"xlsx","n_sheets":9,"sheets":["REFSTORE","IMPORTFORM","INSTRUCTIONS","Abbrev","J. Am. Chem. Soc.","ScienceDirect","Wiley","Springerlink","RSC"],"not_rendered":{"charts":0,"images":0,"macros":1,"external_links":0,"defined_names":1,"comments":0,"pivot_tables":0},"unopened":[],"bounds":{"document_bytes":16777216,"sheet_cells":100000,"rows_first":2000,"rows_last":500,"rows_between":2000,"halvings":0,"cell_chars":16384,"cell_head_chars":4096},"cells_cut":0,"cells_raw":0,"read":"whole","date_system":"1904"}

{"sheet":"REFSTORE","index":0,"n_rows":16109,"n_cols":13,"rows_kept":16109,"cut":false,"hidden":true,"merged":[[1,5,2,5]]}
[]
[null,null,null,null,null,"RefStore"]
[]
[]
[null,null,"ID","DATE","AUTHOR","JOURNAL","YEAR","VOLUME (No)","DOI","PAGE","Website","WIKI","Formated"]
[null,null,1]
[null,null,2]
[null,null,3]
[null,null,4]
[null,null,5]
[null,null,6]
[null,null,7]
[null,null,8]
[null,null,9]
[null,null,10]
[null,null,11]
[null,null,12]
[null,null,13]
[null,null,14]
[null,null,15]
[null,null,16]
[null,null,17]
[null,null,18]
[null,null,19]
[null,null,20]
[null,null,21]
[null,null,22]
[null,null,23]
[null,null,24]
[null,null,25]
[null,null,26]
[null,null,27]
[null,null,28]
[null,null,29]
[null,null,30]
[null,null,31]
[null,null,32]
[null,null,33]
[null,null,34]
[null,null,35]
[null,null,36]
[null,null,37]
[null,null,38]
[null,null,39]
[null,null,40]
[null,null,41]
[null,null,42]
[null,null,43]
[null,null,44]
[null,null,45]
[null,null,46]
[null,null,47]
[null,null,48]
[null,null,49]
[null,null,50]
[null,null,51]
[null,null,52]
[null,null,53]
[null,null,54]
[null,null,55]
[null,null,56]
[null,null,57]
[null,null,58]
[null,null,59]
[null,null,60]
[null,null,61]
[null,null,62]
[null,null,63]
[null,null,64]
[null,null,65]
[null,null,66]
[null,null,67]
[null,null,68]
[null,null,69]
[null,null,70]
[null,null,71]
[null,null,72]
[null,null,73]
[null,null,74]
[null,null,75]
[null,null,76]
[null,null,77]
[null,null,78]
[null,null,79]
[null,null,80]
[null,null,81]
[null,null,82]
[null,null,83]
[null,null,84]
[null,null,85]
[null,null,86]
[null,null,87]
[null,null,88]
[null,null,89]
[null,null,90]
[null,null,91]
[null,null,92]
[null,null,93]
[null,null,94]
[null,null,95]
[null,null,96]
[null,null,97]
[null,null,98]
[null,null,99]
[null,null,100]
[null,null,101]
[null,null,102]
[null,null,103]
[null,null,104]
[null,null,105]
[null,null,106]
[null,null,107]
[null,null,108]
[null,null,109]
[null,null,110]
[null,null,111]
[null,null,112]
[null,null,113]
[null,null,114]
[null,null,115]
[null,null,116]
[null,null,117]
[null,null,118]
[null,null,119]
[null,null,120]
[null,null,121]
[null,null,122]
[null,null,123]
[null,null,124]
[null,null,125]
[null,null,126]
[null,null,127]
[null,null,128]
[null,null,129]
[null,null,130]
[null,null,131]
[null,null,132]
[null,null,133]
[null,null,134]
[null,null,135]
[null,null,136]
[null,null,137]
[null,null,138]
[null,null,139]
[null,null,140]
[null,null,141]
[null,null,142]
[null,null,143]
[null,null,144]
[null,null,145]
[null,null,146]
[null,null,147]
[null,null,148]
[null,null,149]
[null,null,150]
[null,null,151]
[null,null,152]
[null,null,153]
[null,null,154]
[null,null,155]
[null,null,156]
[null,null,157]
[null,null,158]
[null,null,159]
[null,null,160]
[null,null,161]
[null,null,162]
[null,null,163]
[null,null,164]
[null,null,165]
[null,null,166]
[null,null,167]
[null,null,168]
[null,null,169]
[null,null,170]
[null,null,171]
[null,null,172]
[null,null,173]
[null,null,174]
[null,null,175]
[null,null,176]
[null,null,177]
[null,null,178]
[null,null,179]
[null,null,180]
[null,null,181]
[null,null,182]
[null,null,183]
[null,null,184]
[null,null,185]
[null,null,186]
[null,null,187]
[null,null,188]
[null,null,189]
[null,null,190]
[null,null,191]
[null,null,192]
[null,null,193]
[null,null,194]
[null,null,195]
[null,null,196]
[null,null,197]
[null,null,198]
[null,null,199]
[null,null,200]
[null,null,201]
[null,null,202]
[null,null,203]
[null,null,204]
[null,null,205]
[null,null,206]
[null,null,207]
[null,null,208]
[null,null,209]
[null,null,210]
[null,null,211]
[null,null,212]
[null,null,213]
[null,null,214]
[null,null,215]
[null,null,216]
[null,null,217]
[null,null,218]
[null,null,219]
[null,null,220]
[null,null,221]
[null,null,222]
[null,null,223]
[null,null,224]
[null,null,225]
[null,null,226]
[null,null,227]
[null,null,228]
[null,null,229]
[null,null,230]
[null,null,231]
[null,null,232]
[null,null,233]
[null,null,234]
[null,null,235]
[null,null,236]
[null,null,237]
[null,null,238]
[null,null,239]
[null,null,240]
[null,null,241]
[null,null,242]
[null,null,243]
[null,null,244]
[null,null,245]
[null,null,246]
[null,null,247]
[null,null,248]
[null,null,249]
[null,null,250]
[null,null,251]
[null,null,252]
[null,null,253]
[null,null,254]
[null,null,255]
[null,null,256]
[null,null,257]
[null,null,258]
[null,null,259]
[null,null,260]
[null,null,261]
[null,null,262]
[null,null,263]
[null,null,264]
[null,null,265]
[null,null,266]
[null,null,267]
[null,null,268]
[null,null,269]
[null,null,270]
[null,null,271]
[null,null,272]
[null,null,273]
[null,null,274]
[null,null,275]
[null,null,276]
[null,null,277]
[null,null,278]
[null,null,279]
[null,null,280]
[null,null,281]
[null,null,282]
[null,null,283]
[null,null,284]
[null,null,285]
[null,null,286]
[null,null,287]
[null,null,288]
[null,null,289]
[null,null,290]
[null,null,291]
[null,null,292]
[null,null,293]
[null,null,294]
[null,null,295]
[null,null,296]
[null,null,297]
[null,null,298]
[null,null,299]
[null,null,300]
[null,null,301]
[null,null,302]
[null,null,303]
[null,null,304]
[null,null,305]
[null,null,306]
[null,null,307]
[null,null,308]
[null,null,309]
[null,null,310]
[null,null,311]
[null,null,312]
[null,null,313]
[null,null,314]
[null,null,315]
[null,null,316]
[null,null,317]
[null,null,318]
[null,null,319]
[null,null,320]
[null,null,321]
[null,null,322]
[null,null,323]
[null,null,324]
[null,null,325]
[null,null,326]
[null,null,327]
[null,null,328]
[null,null,329]
[null,null,330]
[null,null,331]
[null,null,332]
[null,null,333]
[null,null,334]
[null,null,335]
[null,null,336]
[null,null,337]
[null,null,338]
[null,null,339]
[null,null,340]
[null,null,341]
[null,null,342]
[null,null,343]
[null,null,344]
[null,null,345]
[null,null,346]
[null,null,347]
[null,null,348]
[null,null,349]
[null,null,350]
[null,null,351]
[null,null,352]
[null,null,353]
[null,null,354]
[null,null,355]
[null,null,356]
[null,null,357]
[null,null,358]
[null,null,359]
[null,null,360]
[null,null,361]
[null,null,362]
[null,null,363]
[null,null,364]
[null,null,365]
[null,null,366]
[null,null,367]
[null,null,368]
[null,null,369]
[null,null,370]
[null,null,371]
[null,null,372]
[null,null,373]
[null,null,374]
[null,null,375]
[null,null,376]
[null,null,377]
[null,null,378]
[null,null,379]
[null,null,380]
[null,null,381]
[null,null,382]
[null,null,383]
[null,null,384]
[null,null,385]
[null,null,386]
[null,null,387]
[null,null,388]
[null,null,389]
[null,null,390]
[null,null,391]
[null,null,392]
[null,null,393]
[null,null,394]
[null,null,395]
[null,null,396]
[null,null,397]
[null,null,398]
[null,null,399]
[null,null,400]
[null,null,401]
[null,null,402]
[null,null,403]
[null,null,404]
[null,null,405]
[null,null,406]
[null,null,407]
[null,null,408]
[null,null,409]
[null,null,410]
[null,null,411]
[null,null,412]
[null,null,413]
[null,null,414]
[null,null,415]
[null,null,416]
[null,null,417]
[null,null,418]
[null,null,419]
[null,null,420]
[null,null,421]
[null,null,422]
[null,null,423]
[null,null,424]
[null,null,425]
[null,null,426]
[null,null,427]
[null,null,428]
[null,null,429]
[null,null,430]
[null,null,431]
[null,null,432]
[null,null,433]
[null,null,434]
[null,null,435]
[null,null,436]
[null,null,437]
[null,null,438]
[null,null,439]
[null,null,440]
[null,null,441]
[null,null,442]
[null,null,443]
[null,null,444]
[null,null,445]
[null,null,446]
[null,null,447]
[null,null,448]
[null,null,449]
[null,null,450]
[null,null,451]
[null,null,452]
[null,null,453]
[null,null,454]
[null,null,455]
[null,null,456]
[null,null,457]
[null,null,458]
[null,null,459]
[null,null,460]
[null,null,461]
[null,null,462]
[null,null,463]
[null,null,464]
[null,null,465]
[null,null,466]
[null,null,467]
[null,null,468]
[null,null,469]
[null,null,470]
[null,null,471]
[null,null,472]
[null,null,473]
[null,null,474]
[null,null,475]
[null,null,476]
[null,null,477]
[null,null,478]
[null,null,479]
[null,null,480]
[null,null,481]
[null,null,482]
[null,null,483]
[null,null,484]
[null,null,485]
[null,null,486]
[null,null,487]
[null,null,488]
[null,null,489]
[null,null,490]
[null,null,491]
[null,null,492]
[null,null,493]
[null,null,494]
[null,null,495]
[null,null,496]
[null,null,497]
[null,null,498]
[null,null,499]
[null,null,500]
[null,null,501]
[null,null,502]
[null,null,503]
[null,null,504]
[null,null,505]
[null,null,506]
[null,null,507]
[null,null,508]
[null,null,509]
[null,null,510]
[null,null,511]
[null,null,512]
[null,null,513]
[null,null,514]
[null,null,515]
[null,null,516]
[null,null,517]
[null,null,518]
[null,null,519]
[null,null,520]
[null,null,521]
[null,null,522]
[null,null,523]
[null,null,524]
[null,null,525]
[null,null,526]
[null,null,527]
[null,null,528]
[null,null,529]
[null,null,530]
[null,null,531]
[null,null,532]
[null,null,533]
[null,null,534]
[null,null,535]
[null,null,536]
[null,null,537]
[null,null,538]
[null,null,539]
[null,null,540]
[null,null,541]
[null,null,542]
[null,null,543]
[null,null,544]
[null,null,545]
[null,null,546]
[null,null,547]
[null,null,548]
[null,null,549]
[null,null,550]
[null,null,551]
[null,null,552]
[null,null,553]
[null,null,554]
[null,null,555]
[null,null,556]
[null,null,557]
[null,null,558]
[null,null,559]
[null,null,560]
[null,null,561]
[null,null,562]
[null,null,563]
[null,null,564]
[null,null,565]
[null,null,566]
[null,null,567]
[null,null,568]
[null,null,569]
[null,null,570]
[null,null,571]
[null,null,572]
[null,null,573]
[null,null,574]
[null,null,575]
[null,null,576]
[null,null,577]
[null,null,578]
[null,null,579]
[null,null,580]
[null,null,581]
[null,null,582]
[null,null,583]
[null,null,584]
[null,null,585]
[null,null,586]
[null,null,587]
[null,null,588]
[null,null,589]
[null,null,590]
[null,null,591]
[null,null,592]
[null,null,593]
[null,null,594]
[null,null,595]
[null,null,596]
[null,null,597]
[null,null,598]
[null,null,599]
[null,null,600]
[null,null,601]
[null,null,602]
[null,null,603]
[null,null,604]
[null,null,605]
[null,null,606]
[null,null,607]
[null,null,608]
[null,null,609]
[null,null,610]
[null,null,611]
[null,null,612]
[null,null,613]
[null,null,614]
[null,null,615]
[null,null,616]
[null,null,617]
[null,null,618]
[null,null,619]
[null,null,620]
[null,null,621]
[null,null,622]
[null,null,623]
[null,null,624]
[null,null,625]
[null,null,626]
[null,null,627]
[null,null,628]
[null,null,629]
[null,null,630]
[null,null,631]
[null,null,632]
[null,null,633]
[null,null,634]
[null,null,635]
[null,null,636]
[null,null,637]
[null,null,638]
[null,null,639]
[null,null,640]
[null,null,641]
[null,null,642]
[null,null,643]
[null,null,644]
[null,null,645]
[null,null,646]
[null,null,647]
[null,null,648]
[null,null,649]
[null,null,650]
[null,null,651]
[null,null,652]
[null,null,653]
[null,null,654]
[null,null,655]
[null,null,656]
[null,null,657]
[null,null,658]
[null,null,659]
[null,null,660]
[null,null,661]
[null,null,662]
[null,null,663]
[null,null,664]
[null,null,665]
[null,null,666]
[null,null,667]
[null,null,668]
[null,null,669]
[null,null,670]
[null,null,671]
[null,null,672]
[null,null,673]
[null,null,674]
[null,null,675]
[null,null,676]
[null,null,677]
[null,null,678]
[null,null,679]
[null,null,680]
[null,null,681]
[null,null,682]
[null,null,683]
[null,null,684]
[null,null,685]
[null,null,686]
[null,null,687]
[null,null,688]
[null,null,689]
[null,null,690]
[null,null,691]
[null,null,692]
[null,null,693]
[null,null,694]
[null,null,695]
[null,null,696]
[null,null,697]
[null,null,698]
[null,null,699]
[null,null,700]
[null,null,701]
[null,null,702]
[null,null,703]
[null,null,704]
[null,null,705]
[null,null,706]
[null,null,707]
[null,null,708]
[null,null,709]
[null,null,710]
[null,null,711]
[null,null,712]
[null,null,713]
[null,null,714]
[null,null,715]
[null,null,716]
[null,null,717]
[null,null,718]
[null,null,719]
[null,null,720]
[null,null,721]
[null,null,722]
[null,null,723]
[null,null,724]
[null,null,725]
[null,null,726]
[null,null,727]
[null,null,728]
[null,null,729]
[null,null,730]
[null,null,731]
[null,null,732]
[null,null,733]
[null,null,734]
[null,null,735]
[null,null,736]
[null,null,737]
[null,null,738]
[null,null,739]
[null,null,740]
[null,null,741]
[null,null,742]
[null,null,743]
[null,null,744]
[null,null,745]
[null,null,746]
[null,null,747]
[null,null,748]
[null,null,749]
[null,null,750]
[null,null,751]
[null,null,752]
[null,null,753]
[null,null,754]
[null,null,755]
[null,null,756]
[null,null,757]
[null,null,758]
[null,null,759]
[null,null,760]
[null,null,761]
[null,null,762]
[null,null,763]
[null,null,764]
[null,null,765]
[null,null,766]
[null,null,767]
[null,null,768]
[null,null,769]
[null,null,770]
[null,null,771]
[null,null,772]
[null,null,773]
[null,null,774]
[null,null,775]
[null,null,776]
[null,null,777]
[null,null,778]
[null,null,779]
[null,null,780]
[null,null,781]
[null,null,782]
[null,null,783]
[null,null,784]
[null,null,785]
[null,null,786]
[null,null,787]
[null,null,788]
[null,null,789]
[null,null,790]
[null,null,791]
[null,null,792]
[null,null,793]
[null,null,794]
[null,null,795]
[null,null,796]
[null,null,797]
[null,null,798]
[null,null,799]
[null,null,800]
[null,null,801]
[null,null,802]
[null,null,803]
[null,null,804]
[null,null,805]
[null,null,806]
[null,null,807]
[null,null,808]
[null,null,809]
[null,null,810]
[null,null,811]
[null,null,812]
[null,null,813]
[null,null,814]
[null,null,815]
[null,null,816]
[null,null,817]
[null,null,818]
[null,null,819]
[null,null,820]
[null,null,821]
[null,null,822]
[null,null,823]
[null,null,824]
[null,null,825]
[null,null,826]
[null,null,827]
[null,null,828]
[null,null,829]
[null,null,830]
[null,null,831]
[null,null,832]
[null,null,833]
[null,null,834]
[null,null,835]
[null,null,836]
[null,null,837]
[null,null,838]
[null,null,839]
[null,null,840]
[null,null,841]
[null,null,842]
[null,null,843]
[null,null,844]
[null,null,845]
[null,null,846]
[null,null,847]
[null,null,848]
[null,null,849]
[null,null,850]
[null,null,851]
[null,null,852]
[null,null,853]
[null,null,854]
[null,null,855]
[null,null,856]
[null,null,857]
[null,null,858]
[null,null,859]
[null,null,860]
[null,null,861]
[null,null,862]
[null,null,863]
[null,null,864]
[null,null,865]
[null,null,866]
[null,null,867]
[null,null,868]
[null,null,869]
[null,null,870]
[null,null,871]
[null,null,872]
[null,null,873]
[null,null,874]
[null,null,875]
[null,null,876]
[null,null,877]
[null,null,878]
[null,null,879]
[null,null,880]
[null,null,881]
[null,null,882]
[null,null,883]
[null,null,884]
[null,null,885]
[null,null,886]
[null,null,887]
[null,null,888]
[null,null,889]
[null,null,890]
[null,null,891]
[null,null,892]
[null,null,893]
[null,null,894]
[null,null,895]
[null,null,896]
[null,null,897]
[null,null,898]
[null,null,899]
[null,null,900]
[null,null,901]
[null,null,902]
[null,null,903]
[null,null,904]
[null,null,905]
[null,null,906]
[null,null,907]
[null,null,908]
[null,null,909]
[null,null,910]
[null,null,911]
[null,null,912]
[null,null,913]
[null,null,914]
[null,null,915]
[null,null,916]
[null,null,917]
[null,null,918]
[null,null,919]
[null,null,920]
[null,null,921]
[null,null,922]
[null,null,923]
[null,null,924]
[null,null,925]
[null,null,926]
[null,null,927]
[null,null,928]
[null,null,929]
[null,null,930]
[null,null,931]
[null,null,932]
[null,null,933]
[null,null,934]
[null,null,935]
[null,null,936]
[null,null,937]
[null,null,938]
[null,null,939]
[null,null,940]
[null,null,941]
[null,null,942]
[null,null,943]
[null,null,944]
[null,null,945]
[null,null,946]
[null,null,947]
[null,null,948]
[null,null,949]
[null,null,950]
[null,null,951]
[null,null,952]
[null,null,953]
[null,null,954]
[null,null,955]
[null,null,956]
[null,null,957]
[null,null,958]
[null,null,959]
[null,null,960]
[null,null,961]
[null,null,962]
[null,null,963]
[null,null,964]
[null,null,965]
[null,null,966]
[null,null,967]
[null,null,968]
[null,null,969]
[null,null,970]
[null,null,971]
[null,null,972]
[null,null,973]
[null,null,974]
[null,null,975]
[null,null,976]
[null,null,977]
[null,null,978]
[null,null,979]
[null,null,980]
[null,null,981]
[null,null,982]
[null,null,983]
[null,null,984]
[null,null,985]
[null,null,986]
[null,null,987]
[null,null,988]
[null,null,989]
[null,null,990]
[null,null,991]
[null,null,992]
[null,null,993]
[null,null,994]
[null,null,995]
[null,null,996]
[null,null,997]
[null,null,998]
[null,null,999]
[null,null,1000]
[null,null,1001]
[null,null,1002]
[null,null,1003]
[null,null,1004]
[null,null,1005]
[null,null,1006]
[null,null,1007]
[null,null,1008]
[null,null,1009]
[null,null,1010]
[null,null,1011]
[null,null,1012]
[null,null,1013]
[null,null,1014]
[null,null,1015]
[null,null,1016]
[null,null,1017]
[null,null,1018]
[null,null,1019]
[null,null,1020]
[null,null,1021]
[null,null,1022]
[null,null,1023]
[null,null,1024]
[null,null,1025]
[null,null,1026]
[null,null,1027]
[null,null,1028]
[null,null,1029]
[null,null,1030]
[null,null,1031]
[null,null,1032]
[null,null,1033]
[null,null,1034]
[null,null,1035]
[null,null,1036]
[null,null,1037]
[null,null,1038]
[null,null,1039]
[null,null,1040]
[null,null,1041]
[null,null,1042]
[null,null,1043]
[null,null,1044]
[null,null,1045]
[null,null,1046]
[null,null,1047]
[null,null,1048]
[null,null,1049]
[null,null,1050]
[null,null,1051]
[null,null,1052]
[null,null,1053]
[null,null,1054]
[null,null,1055]
[null,null,1056]
[null,null,1057]
[null,null,1058]
[null,null,1059]
[null,null,1060]
[null,null,1061]
[null,null,1062]
[null,null,1063]
[null,null,1064]
[null,null,1065]
[null,null,1066]
[null,null,1067]
[null,null,1068]
[null,null,1069]
[null,null,1070]
[null,null,1071]
[null,null,1072]
[null,null,1073]
[null,null,1074]
[null,null,1075]
[null,null,1076]
[null,null,1077]
[null,null,1078]
[null,null,1079]
[null,null,1080]
[null,null,1081]
[null,null,1082]
[null,null,1083]
[null,null,1084]
[null,null,1085]
[null,null,1086]
[null,null,1087]
[null,null,1088]
[null,null,1089]
[null,null,1090]
[null,null,1091]
[null,null,1092]
[null,null,1093]
[null,null,1094]
[null,null,1095]
[null,null,1096]
[null,null,1097]
[null,null,1098]
[null,null,1099]
[null,null,1100]
[null,null,1101]
[null,null,1102]
[null,null,1103]
[null,null,1104]
[null,null,1105]
[null,null,1106]
[null,null,1107]
[null,null,1108]
[null,null,1109]
[null,null,1110]
[null,null,1111]
[null,null,1112]
[null,null,1113]
[null,null,1114]
[null,null,1115]
[null,null,1116]
[null,null,1117]
[null,null,1118]
[null,null,1119]
[null,null,1120]
[null,null,1121]
[null,null,1122]
[null,null,1123]
[null,null,1124]
[null,null,1125]
[null,null,1126]
[null,null,1127]
[null,null,1128]
[null,null,1129]
[null,null,1130]
[null,null,1131]
[null,null,1132]
[null,null,1133]
[null,null,1134]
[null,null,1135]
[null,null,1136]
[null,null,1137]
[null,null,1138]
[null,null,1139]
[null,null,1140]
[null,null,1141]
[null,null,1142]
[null,null,1143]
[null,null,1144]
[null,null,1145]
[null,null,1146]
[null,null,1147]
[null,null,1148]
[null,null,1149]
[null,null,1150]
[null,null,1151]
[null,null,1152]
[null,null,1153]
[null,null,1154]
[null,null,1155]
[null,null,1156]
[null,null,1157]
[null,null,1158]
[null,null,1159]
[null,null,1160]
[null,null,1161]
[null,null,1162]
[null,null,1163]
[null,null,1164]
[null,null,1165]
[null,null,1166]
[null,null,1167]
[null,null,1168]
[null,null,1169]
[null,null,1170]
[null,null,1171]
[null,null,1172]
[null,null,1173]
[null,null,1174]
[null,null,1175]
[null,null,1176]
[null,null,1177]
[null,null,1178]
[null,null,1179]
[null,null,1180]
[null,null,1181]
[null,null,1182]
[null,null,1183]
[null,null,1184]
[null,null,1185]
[null,null,1186]
[null,null,1187]
[null,null,1188]
[null,null,1189]
[null,null,1190]
[null,null,1191]
[null,null,1192]
[null,null,1193]
[null,null,1194]
[null,null,1195]
[null,null,1196]
[null,null,1197]
[null,null,1198]
[null,null,1199]
[null,null,1200]
[null,null,1201]
[null,null,1202]
[null,null,1203]
[null,null,1204]
[null,null,1205]
[null,null,1206]
[null,null,1207]
[null,null,1208]
[null,null,1209]
[null,null,1210]
[null,null,1211]
[null,null,1212]
[null,null,1213]
[null,null,1214]
[null,null,1215]
[null,null,1216]
[null,null,1217]
[null,null,1218]
[null,null,1219]
[null,null,1220]
[null,null,1221]
[null,null,1222]
[null,null,1223]
[null,null,1224]
[null,null,1225]
[null,null,1226]
[null,null,1227]
[null,null,1228]
[null,null,1229]
[null,null,1230]
[null,null,1231]
[null,null,1232]
[null,null,1233]
[null,null,1234]
[null,null,1235]
[null,null,1236]
[null,null,1237]
[null,null,1238]
[null,null,1239]
[null,null,1240]
[null,null,1241]
[null,null,1242]
[null,null,1243]
[null,null,1244]
[null,null,1245]
[null,null,1246]
[null,null,1247]
[null,null,1248]
[null,null,1249]
[null,null,1250]
[null,null,1251]
[null,null,1252]
[null,null,1253]
[null,null,1254]
[null,null,1255]
[null,null,1256]
[null,null,1257]
[null,null,1258]
[null,null,1259]
[null,null,1260]
[null,null,1261]
[null,null,1262]
[null,null,1263]
[null,null,1264]
[null,null,1265]
[null,null,1266]
[null,null,1267]
[null,null,1268]
[null,null,1269]
[null,null,1270]
[null,null,1271]
[null,null,1272]
[null,null,1273]
[null,null,1274]
[null,null,1275]
[null,null,1276]
[null,null,1277]
[null,null,1278]
[null,null,1279]
[null,null,1280]
[null,null,1281]
[null,null,1282]
[null,null,1283]
[null,null,1284]
[null,null,1285]
[null,null,1286]
[null,null,1287]
[null,null,1288]
[null,null,1289]
[null,null,1290]
[null,null,1291]
[null,null,1292]
[null,null,1293]
[null,null,1294]
[null,null,1295]
[null,null,1296]
[null,null,1297]
[null,null,1298]
[null,null,1299]
[null,null,1300]
[null,null,1301]
[null,null,1302]
[null,null,1303]
[null,null,1304]
[null,null,1305]
[null,null,1306]
[null,null,1307]
[null,null,1308]
[null,null,1309]
[null,null,1310]
[null,null,1311]
[null,null,1312]
[null,null,1313]
[null,null,1314]
[null,null,1315]
[null,null,1316]
[null,null,1317]
[null,null,1318]
[null,null,1319]
[null,null,1320]
[null,null,1321]
[null,null,1322]
[null,null,1323]
[null,null,1324]
[null,null,1325]
[null,null,1326]
[null,null,1327]
[null,null,1328]
[null,null,1329]
[null,null,1330]
[null,null,1331]
[null,null,1332]
[null,null,1333]
[null,null,1334]
[null,null,1335]
[null,null,1336]
[null,null,1337]
[null,null,1338]
[null,null,1339]
[null,null,1340]
[null,null,1341]
[null,null,1342]
[null,null,1343]
[null,null,1344]
[null,null,1345]
[null,null,1346]
[null,null,1347]
[null,null,1348]
[null,null,1349]
[null,null,1350]
[null,null,1351]
[null,null,1352]
[null,null,1353]
[null,null,1354]
[null,null,1355]
[null,null,1356]
[null,null,1357]
[null,null,1358]
[null,null,1359]
[null,null,1360]
[null,null,1361]
[null,null,1362]
[null,null,1363]
[null,null,1364]
[null,null,1365]
[null,null,1366]
[null,null,1367]
[null,null,1368]
[null,null,1369]
[null,null,1370]
[null,null,1371]
[null,null,1372]
[null,null,1373]
[null,null,1374]
[null,null,1375]
[null,null,1376]
[null,null,1377]
[null,null,1378]
[null,null,1379]
[null,null,1380]
[null,null,1381]
[null,null,1382]
[null,null,1383]
[null,null,1384]
[null,null,1385]
[null,null,1386]
[null,null,1387]
[null,null,1388]
[null,null,1389]
[null,null,1390]
[null,null,1391]
[null,null,1392]
[null,null,1393]
[null,null,1394]
[null,null,1395]
[null,null,1396]
[null,null,1397]
[null,null,1398]
[null,null,1399]
[null,null,1400]
[null,null,1401]
[null,null,1402]
[null,null,1403]
[null,null,1404]
[null,null,1405]
[null,null,1406]
[null,null,1407]
[null,null,1408]
[null,null,1409]
[null,null,1410]
[null,null,1411]
[null,null,1412]
[null,null,1413]
[null,null,1414]
[null,null,1415]
[null,null,1416]
[null,null,1417]
[null,null,1418]
[null,null,1419]
[null,null,1420]
[null,null,1421]
[null,null,1422]
[null,null,1423]
[null,null,1424]
[null,null,1425]
[null,null,1426]
[null,null,1427]
[null,null,1428]
[null,null,1429]
[null,null,1430]
[null,null,1431]
[null,null,1432]
[null,null,1433]
[null,null,1434]
[null,null,1435]
[null,null,1436]
[null,null,1437]
[null,null,1438]
[null,null,1439]
[null,null,1440]
[null,null,1441]
[null,null,1442]
[null,null,1443]
[null,null,1444]
[null,null,1445]
[null,null,1446]
[null,null,1447]
[null,null,1448]
[null,null,1449]
[null,null,1450]
[null,null,1451]
[null,null,1452]
[null,null,1453]
[null,null,1454]
[null,null,1455]
[null,null,1456]
[null,null,1457]
[null,null,1458]
[null,null,1459]
[null,null,1460]
[null,null,1461]
[null,null,1462]
[null,null,1463]
[null,null,1464]
[null,null,1465]
[null,null,1466]
[null,null,1467]
[null,null,1468]
[null,null,1469]
[null,null,1470]
[null,null,1471]
[null,null,1472]
[null,null,1473]
[null,null,1474]
[null,null,1475]
[null,null,1476]
[null,null,1477]
[null,null,1478]
[null,null,1479]
[null,null,1480]
[null,null,1481]
[null,null,1482]
[null,null,1483]
[null,null,1484]
[null,null,1485]
[null,null,1486]
[null,null,1487]
[null,null,1488]
[null,null,1489]
[null,null,1490]
[null,null,1491]
[null,null,1492]
[null,null,1493]
[null,null,1494]
[null,null,1495]
[null,null,1496]
[null,null,1497]
[null,null,1498]
[null,null,1499]
[null,null,1500]
[null,null,1501]
[null,null,1502]
[null,null,1503]
[null,null,1504]
[null,null,1505]
[null,null,1506]
[null,null,1507]
[null,null,1508]
[null,null,1509]
[null,null,1510]
[null,null,1511]
[null,null,1512]
[null,null,1513]
[null,null,1514]
[null,null,1515]
[null,null,1516]
[null,null,1517]
[null,null,1518]
[null,null,1519]
[null,null,1520]
[null,null,1521]
[null,null,1522]
[null,null,1523]
[null,null,1524]
[null,null,1525]
[null,null,1526]
[null,null,1527]
[null,null,1528]
[null,null,1529]
[null,null,1530]
[null,null,1531]
[null,null,1532]
[null,null,1533]
[null,null,1534]
[null,null,1535]
[null,null,1536]
[null,null,1537]
[null,null,1538]
[null,null,1539]
[null,null,1540]
[null,null,1541]
[null,null,1542]
[null,null,1543]
[null,null,1544]
[null,null,1545]
[null,null,1546]
[null,null,1547]
[null,null,1548]
[null,null,1549]
[null,null,1550]
[null,null,1551]
[null,null,1552]
[null,null,1553]
[null,null,1554]
[null,null,1555]
[null,null,1556]
[null,null,1557]
[null,null,1558]
[null,null,1559]
[null,null,1560]
[null,null,1561]
[null,null,1562]
[null,null,1563]
[null,null,1564]
[null,null,1565]
[null,null,1566]
[null,null,1567]
[null,null,1568]
[null,null,1569]
[null,null,1570]
[null,null,1571]
[null,null,1572]
[null,null,1573]
[null,null,1574]
[null,null,1575]
[null,null,1576]
[null,null,1577]
[null,null,1578]
[null,null,1579]
[null,null,1580]
[null,null,1581]
[null,null,1582]
[null,null,1583]
[null,null,1584]
[null,null,1585]
[null,null,1586]
[null,null,1587]
[null,null,1588]
[null,null,1589]
[null,null,1590]
[null,null,1591]
[null,null,1592]
[null,null,1593]
[null,null,1594]
[null,null,1595]
[null,null,1596]
[null,null,1597]
[null,null,1598]
[null,null,1599]
[null,null,1600]
[null,null,1601]
[null,null,1602]
[null,null,1603]
[null,null,1604]
[null,null,1605]
[null,null,1606]
[null,null,1607]
[null,null,1608]
[null,null,1609]
[null,null,1610]
[null,null,1611]
[null,null,1612]
[null,null,1613]
[null,null,1614]
[null,null,1615]
[null,null,1616]
[null,null,1617]
[null,null,1618]
[null,null,1619]
[null,null,1620]
[null,null,1621]
[null,null,1622]
[null,null,1623]
[null,null,1624]
[null,null,1625]
[null,null,1626]
[null,null,1627]
[null,null,1628]
[null,null,1629]
[null,null,1630]
[null,null,1631]
[null,null,1632]
[null,null,1633]
[null,null,1634]
[null,null,1635]
[null,null,1636]
[null,null,1637]
[null,null,1638]
[null,null,1639]
[null,null,1640]
[null,null,1641]
[null,null,1642]
[null,null,1643]
[null,null,1644]
[null,null,1645]
[null,null,1646]
[null,null,1647]
[null,null,1648]
[null,null,1649]
[null,null,1650]
[null,null,1651]
[null,null,1652]
[null,null,1653]
[null,null,1654]
[null,null,1655]
[null,null,1656]
[null,null,1657]
[null,null,1658]
[null,null,1659]
[null,null,1660]
[null,null,1661]
[null,null,1662]
[null,null,1663]
[null,null,1664]
[null,null,1665]
[null,null,1666]
[null,null,1667]
[null,null,1668]
[null,null,1669]
[null,null,1670]
[null,null,1671]
[null,null,1672]
[null,null,1673]
[null,null,1674]
[null,null,1675]
[null,null,1676]
[null,null,1677]
[null,null,1678]
[null,null,1679]
[null,null,1680]
[null,null,1681]
[null,null,1682]
[null,null,1683]
[null,null,1684]
[null,null,1685]
[null,null,1686]
[null,null,1687]
[null,null,1688]
[null,null,1689]
[null,null,1690]
[null,null,1691]
[null,null,1692]
[null,null,1693]
[null,null,1694]
[null,null,1695]
[null,null,1696]
[null,null,1697]
[null,null,1698]
[null,null,1699]
[null,null,1700]
[null,null,1701]
[null,null,1702]
[null,null,1703]
[null,null,1704]
[null,null,1705]
[null,null,1706]
[null,null,1707]
[null,null,1708]
[null,null,1709]
[null,null,1710]
[null,null,1711]
[null,null,1712]
[null,null,1713]
[null,null,1714]
[null,null,1715]
[null,null,1716]
[null,null,1717]
[null,null,1718]
[null,null,1719]
[null,null,1720]
[null,null,1721]
[null,null,1722]
[null,null,1723]
[null,null,1724]
[null,null,1725]
[null,null,1726]
[null,null,1727]
[null,null,1728]
[null,null,1729]
[null,null,1730]
[null,null,1731]
[null,null,1732]
[null,null,1733]
[null,null,1734]
[null,null,1735]
[null,null,1736]
[null,null,1737]
[null,null,1738]
[null,null,1739]
[null,null,1740]
[null,null,1741]
[null,null,1742]
[null,null,1743]
[null,null,1744]
[null,null,1745]
[null,null,1746]
[null,null,1747]
[null,null,1748]
[null,null,1749]
[null,null,1750]
[null,null,1751]
[null,null,1752]
[null,null,1753]
[null,null,1754]
[null,null,1755]
[null,null,1756]
[null,null,1757]
[null,null,1758]
[null,null,1759]
[null,null,1760]
[null,null,1761]
[null,null,1762]
[null,null,1763]
[null,null,1764]
[null,null,1765]
[null,null,1766]
[null,null,1767]
[null,null,1768]
[null,null,1769]
[null,null,1770]
[null,null,1771]
[null,null,1772]
[null,null,1773]
[null,null,1774]
[null,null,1775]
[null,null,1776]
[null,null,1777]
[null,null,1778]
[null,null,1779]
[null,null,1780]
[null,null,1781]
[null,null,1782]
[null,null,1783]
[null,null,1784]
[null,null,1785]
[null,null,1786]
[null,null,1787]
[null,null,1788]
[null,null,1789]
[null,null,1790]
[null,null,1791]
[null,null,1792]
[null,null,1793]
[null,null,1794]
[null,null,1795]
[null,null,1796]
[null,null,1797]
[null,null,1798]
[null,null,1799]
[null,null,1800]
[null,null,1801]
[null,null,1802]
[null,null,1803]
[null,null,1804]
[null,null,1805]
[null,null,1806]
[null,null,1807]
[null,null,1808]
[null,null,1809]
[null,null,1810]
[null,null,1811]
[null,null,1812]
[null,null,1813]
[null,null,1814]
[null,null,1815]
[null,null,1816]
[null,null,1817]
[null,null,1818]
[null,null,1819]
[null,null,1820]
[null,null,1821]
[null,null,1822]
[null,null,1823]
[null,null,1824]
[null,null,1825]
[null,null,1826]
[null,null,1827]
[null,null,1828]
[null,null,1829]
[null,null,1830]
[null,null,1831]
[null,null,1832]
[null,null,1833]
[null,null,1834]
[null,null,1835]
[null,null,1836]
[null,null,1837]
[null,null,1838]
[null,null,1839]
[null,null,1840]
[null,null,1841]
[null,null,1842]
[null,null,1843]
[null,null,1844]
[null,null,1845]
[null,null,1846]
[null,null,1847]
[null,null,1848]
[null,null,1849]
[null,null,1850]
[null,null,1851]
[null,null,1852]
[null,null,1853]
[null,null,1854]
[null,null,1855]
[null,null,1856]
[null,null,1857]
[null,null,1858]
[null,null,1859]
[null,null,1860]
[null,null,1861]
[null,null,1862]
[null,null,1863]
[null,null,1864]
[null,null,1865]
[null,null,1866]
[null,null,1867]
[null,null,1868]
[null,null,1869]
[null,null,1870]
[null,null,1871]
[null,null,1872]
[null,null,1873]
[null,null,1874]
[null,null,1875]
[null,null,1876]
[null,null,1877]
[null,null,1878]
[null,null,1879]
[null,null,1880]
[null,null,1881]
[null,null,1882]
[null,null,1883]
[null,null,1884]
[null,null,1885]
[null,null,1886]
[null,null,1887]
[null,null,1888]
[null,null,1889]
[null,null,1890]
[null,null,1891]
[null,null,1892]
[null,null,1893]
[null,null,1894]
[null,null,1895]
[null,null,1896]
[null,null,1897]
[null,null,1898]
[null,null,1899]
[null,null,1900]
[null,null,1901]
[null,null,1902]
[null,null,1903]
[null,null,1904]
[null,null,1905]
[null,null,1906]
[null,null,1907]
[null,null,1908]
[null,null,1909]
[null,null,1910]
[null,null,1911]
[null,null,1912]
[null,null,1913]
[null,null,1914]
[null,null,1915]
[null,null,1916]
[null,null,1917]
[null,null,1918]
[null,null,1919]
[null,null,1920]
[null,null,1921]
[null,null,1922]
[null,null,1923]
[null,null,1924]
[null,null,1925]
[null,null,1926]
[null,null,1927]
[null,null,1928]
[null,null,1929]
[null,null,1930]
[null,null,1931]
[null,null,1932]
[null,null,1933]
[null,null,1934]
[null,null,1935]
[null,null,1936]
[null,null,1937]
[null,null,1938]
[null,null,1939]
[null,null,1940]
[null,null,1941]
[null,null,1942]
[null,null,1943]
[null,null,1944]
[null,null,1945]
[null,null,1946]
[null,null,1947]
[null,null,1948]
[null,null,1949]
[null,null,1950]
[null,null,1951]
[null,null,1952]
[null,null,1953]
[null,null,1954]
[null,null,1955]
[null,null,1956]
[null,null,1957]
[null,null,1958]
[null,null,1959]
[null,null,1960]
[null,null,1961]
[null,null,1962]
[null,null,1963]
[null,null,1964]
[null,null,1965]
[null,null,1966]
[null,null,1967]
[null,null,1968]
[null,null,1969]
[null,null,1970]
[null,null,1971]
[null,null,1972]
[null,null,1973]
[null,null,1974]
[null,null,1975]
[null,null,1976]
[null,null,1977]
[null,null,1978]
[null,null,1979]
[null,null,1980]
[null,null,1981]
[null,null,1982]
[null,null,1983]
[null,null,1984]
[null,null,1985]
[null,null,1986]
[null,null,1987]
[null,null,1988]
[null,null,1989]
[null,null,1990]
[null,null,1991]
[null,null,1992]
[null,null,1993]
[null,null,1994]
[null,null,1995]
[null,null,1996]
[null,null,1997]
[null,null,1998]
[null,null,1999]
[null,null,2000]
[null,null,2001]
[null,null,2002]
[null,null,2003]
[null,null,2004]
[null,null,2005]
[null,null,2006]
[null,null,2007]
[null,null,2008]
[null,null,2009]
[null,null,2010]
[null,null,2011]
[null,null,2012]
[null,null,2013]
[null,null,2014]
[null,null,2015]
[null,null,2016]
[null,null,2017]
[null,null,2018]
[null,null,2019]
[null,null,2020]
[null,null,2021]
[null,null,2022]
[null,null,2023]
[null,null,2024]
[null,null,2025]
[null,null,2026]
[null,null,2027]
[null,null,2028]
[null,null,2029]
[null,null,2030]
[null,null,2031]
[null,null,2032]
[null,null,2033]
[null,null,2034]
[null,null,2035]
[null,null,2036]
[null,null,2037]
[null,null,2038]
[null,null,2039]
[null,null,2040]
[null,null,2041]
[null,null,2042]
[null,null,2043]
[null,null,2044]
[null,null,2045]
[null,null,2046]
[null,null,2047]
[null,null,2048]
[null,null,2049]
[null,null,2050]
[null,null,2051]
[null,null,2052]
[null,null,2053]
[null,null,2054]
[null,null,2055]
[null,null,2056]
[null,null,2057]
[null,null,2058]
[null,null,2059]
[null,null,2060]
[null,null,2061]
[null,null,2062]
[null,null,2063]
[null,null,2064]
[null,null,2065]
[null,null,2066]
[null,null,2067]
[null,null,2068]
[null,null,2069]
[null,null,2070]
[null,null,2071]
[null,null,2072]
[null,null,2073]
[null,null,2074]
[null,null,2075]
[null,null,2076]
[null,null,2077]
[null,null,2078]
[null,null,2079]
[null,null,2080]
[null,null,2081]
[null,null,2082]
[null,null,2083]
[null,null,2084]
[null,null,2085]
[null,null,2086]
[null,null,2087]
[null,null,2088]
[null,null,2089]
[null,null,2090]
[null,null,2091]
[null,null,2092]
[null,null,2093]
[null,null,2094]
[null,null,2095]
[null,null,2096]
[null,null,2097]
[null,null,2098]
[null,null,2099]
[null,null,2100]
[null,null,2101]
[null,null,2102]
[null,null,2103]
[null,null,2104]
[null,null,2105]
[null,null,2106]
[null,null,2107]
[null,null,2108]
[null,null,2109]
[null,null,2110]
[null,null,2111]
[null,null,2112]
[null,null,2113]
[null,null,2114]
[null,null,2115]
[null,null,2116]
[null,null,2117]
[null,null,2118]
[null,null,2119]
[null,null,2120]
[null,null,2121]
[null,null,2122]
[null,null,2123]
[null,null,2124]
[null,null,2125]
[null,null,2126]
[null,null,2127]
[null,null,2128]
[null,null,2129]
[null,null,2130]
[null,null,2131]
[null,null,2132]
[null,null,2133]
[null,null,2134]
[null,null,2135]
[null,null,2136]
[null,null,2137]
[null,null,2138]
[null,null,2139]
[null,null,2140]
[null,null,2141]
[null,null,2142]
[null,null,2143]
[null,null,2144]
[null,null,2145]
[null,null,2146]
[null,null,2147]
[null,null,2148]
[null,null,2149]
[null,null,2150]
[null,null,2151]
[null,null,2152]
[null,null,2153]
[null,null,2154]
[null,null,2155]
[null,null,2156]
[null,null,2157]
[null,null,2158]
[null,null,2159]
[null,null,2160]
[null,null,2161]
[null,null,2162]
[null,null,2163]
[null,null,2164]
[null,null,2165]
[null,null,2166]
[null,null,2167]
[null,null,2168]
[null,null,2169]
[null,null,2170]
[null,null,2171]
[null,null,2172]
[null,null,2173]
[null,null,2174]
[null,null,2175]
[null,null,2176]
[null,null,2177]
[null,null,2178]
[null,null,2179]
[null,null,2180]
[null,null,2181]
[null,null,2182]
[null,null,2183]
[null,null,2184]
[null,null,2185]
[null,null,2186]
[null,null,2187]
[null,null,2188]
[null,null,2189]
[null,null,2190]
[null,null,2191]
[null,null,2192]
[null,null,2193]
[null,null,2194]
[null,null,2195]
[null,null,2196]
[null,null,2197]
[null,null,2198]
[null,null,2199]
[null,null,2200]
[null,null,2201]
[null,null,2202]
[null,null,2203]
[null,null,2204]
[null,null,2205]
[null,null,2206]
[null,null,2207]
[null,null,2208]
[null,null,2209]
[null,null,2210]
[null,null,2211]
[null,null,2212]
[null,null,2213]
[null,null,2214]
[null,null,2215]
[null,null,2216]
[null,null,2217]
[null,null,2218]
[null,null,2219]
[null,null,2220]
[null,null,2221]
[null,null,2222]
[null,null,2223]
[null,null,2224]
[null,null,2225]
[null,null,2226]
[null,null,2227]
[null,null,2228]
[null,null,2229]
[null,null,2230]
[null,null,2231]
[null,null,2232]
[null,null,2233]
[null,null,2234]
[null,null,2235]
[null,null,2236]
[null,null,2237]
[null,null,2238]
[null,null,2239]
[null,null,2240]
[null,null,2241]
[null,null,2242]
[null,null,2243]
[null,null,2244]
[null,null,2245]
[null,null,2246]
[null,null,2247]
[null,null,2248]
[null,null,2249]
[null,null,2250]
[null,null,2251]
[null,null,2252]
[null,null,2253]
[null,null,2254]
[null,null,2255]
[null,null,2256]
[null,null,2257]
[null,null,2258]
[null,null,2259]
[null,null,2260]
[null,null,2261]
[null,null,2262]
[null,null,2263]
[null,null,2264]
[null,null,2265]
[null,null,2266]
[null,null,2267]
[null,null,2268]
[null,null,2269]
[null,null,2270]
[null,null,2271]
[null,null,2272]
[null,null,2273]
[null,null,2274]
[null,null,2275]
[null,null,2276]
[null,null,2277]
[null,null,2278]
[null,null,2279]
[null,null,2280]
[null,null,2281]
[null,null,2282]
[null,null,2283]
[null,null,2284]
[null,null,2285]
[null,null,2286]
[null,null,2287]
[null,null,2288]
[null,null,2289]
[null,null,2290]
[null,null,2291]
[null,null,2292]
[null,null,2293]
[null,null,2294]
[null,null,2295]
[null,null,2296]
[null,null,2297]
[null,null,2298]
[null,null,2299]
[null,null,2300]
[null,null,2301]
[null,null,2302]
[null,null,2303]
[null,null,2304]
[null,null,2305]
[null,null,2306]
[null,null,2307]
[null,null,2308]
[null,null,2309]
[null,null,2310]
[null,null,2311]
[null,null,2312]
[null,null,2313]
[null,null,2314]
[null,null,2315]
[null,null,2316]
[null,null,2317]
[null,null,2318]
[null,null,2319]
[null,null,2320]
[null,null,2321]
[null,null,2322]
[null,null,2323]
[null,null,2324]
[null,null,2325]
[null,null,2326]
[null,null,2327]
[null,null,2328]
[null,null,2329]
[null,null,2330]
[null,null,2331]
[null,null,2332]
[null,null,2333]
[null,null,2334]
[null,null,2335]
[null,null,2336]
[null,null,2337]
[null,null,2338]
[null,null,2339]
[null,null,2340]
[null,null,2341]
[null,null,2342]
[null,null,2343]
[null,null,2344]
[null,null,2345]
[null,null,2346]
[null,null,2347]
[null,null,2348]
[null,null,2349]
[null,null,2350]
[null,null,2351]
[null,null,2352]
[null,null,2353]
[null,null,2354]
[null,null,2355]
[null,null,2356]
[null,null,2357]
[null,null,2358]
[null,null,2359]
[null,null,2360]
[null,null,2361]
[null,null,2362]
[null,null,2363]
[null,null,2364]
[null,null,2365]
[null,null,2366]
[null,null,2367]
[null,null,2368]
[null,null,2369]
[null,null,2370]
[null,null,2371]
[null,null,2372]
[null,null,2373]
[null,null,2374]
[null,null,2375]
[null,null,2376]
[null,null,2377]
[null,null,2378]
[null,null,2379]
[null,null,2380]
[null,null,2381]
[null,null,2382]
[null,null,2383]
[null,null,2384]
[null,null,2385]
[null,null,2386]
[null,null,2387]
[null,null,2388]
[null,null,2389]
[null,null,2390]
[null,null,2391]
[null,null,2392]
[null,null,2393]
[null,null,2394]
[null,null,2395]
[null,null,2396]
[null,null,2397]
[null,null,2398]
[null,null,2399]
[null,null,2400]
[null,null,2401]
[null,null,2402]
[null,null,2403]
[null,null,2404]
[null,null,2405]
[null,null,2406]
[null,null,2407]
[null,null,2408]
[null,null,2409]
[null,null,2410]
[null,null,2411]
[null,null,2412]
[null,null,2413]
[null,null,2414]
[null,null,2415]
[null,null,2416]
[null,null,2417]
[null,null,2418]
[null,null,2419]
[null,null,2420]
[null,null,2421]
[null,null,2422]
[null,null,2423]
[null,null,2424]
[null,null,2425]
[null,null,2426]
[null,null,2427]
[null,null,2428]
[null,null,2429]
[null,null,2430]
[null,null,2431]
[null,null,2432]
[null,null,2433]
[null,null,2434]
[null,null,2435]
[null,null,2436]
[null,null,2437]
[null,null,2438]
[null,null,2439]
[null,null,2440]
[null,null,2441]
[null,null,2442]
[null,null,2443]
[null,null,2444]
[null,null,2445]
[null,null,2446]
[null,null,2447]
[null,null,2448]
[null,null,2449]
[null,null,2450]
[null,null,2451]
[null,null,2452]
[null,null,2453]
[null,null,2454]
[null,null,2455]
[null,null,2456]
[null,null,2457]
[null,null,2458]
[null,null,2459]
[null,null,2460]
[null,null,2461]
[null,null,2462]
[null,null,2463]
[null,null,2464]
[null,null,2465]
[null,null,2466]
[null,null,2467]
[null,null,2468]
[null,null,2469]
[null,null,2470]
[null,null,2471]
[null,null,2472]
[null,null,2473]
[null,null,2474]
[null,null,2475]
[null,null,2476]
[null,null,2477]
[null,null,2478]
[null,null,2479]
[null,null,2480]
[null,null,2481]
[null,null,2482]
[null,null,2483]
[null,null,2484]
[null,null,2485]
[null,null,2486]
[null,null,2487]
[null,null,2488]
[null,null,2489]
[null,null,2490]
[null,null,2491]
[null,null,2492]
[null,null,2493]
[null,null,2494]
[null,null,2495]
[null,null,2496]
[null,null,2497]
[null,null,2498]
[null,null,2499]
[null,null,2500]
[null,null,2501]
[null,null,2502]
[null,null,2503]
[null,null,2504]
[null,null,2505]
[null,null,2506]
[null,null,2507]
[null,null,2508]
[null,null,2509]
[null,null,2510]
[null,null,2511]
[null,null,2512]
[null,null,2513]
[null,null,2514]
[null,null,2515]
[null,null,2516]
[null,null,2517]
[null,null,2518]
[null,null,2519]
[null,null,2520]
[null,null,2521]
[null,null,2522]
[null,null,2523]
[null,null,2524]
[null,null,2525]
[null,null,2526]
[null,null,2527]
[null,null,2528]
[null,null,2529]
[null,null,2530]
[null,null,2531]
[null,null,2532]
[null,null,2533]
[null,null,2534]
[null,null,2535]
[null,null,2536]
[null,null,2537]
[null,null,2538]
[null,null,2539]
[null,null,2540]
[null,null,2541]
[null,null,2542]
[null,null,2543]
[null,null,2544]
[null,null,2545]
[null,null,2546]
[null,null,2547]
[null,null,2548]
[null,null,2549]
[null,null,2550]
[null,null,2551]
[null,null,2552]
[null,null,2553]
[null,null,2554]
[null,null,2555]
[null,null,2556]
[null,null,2557]
[null,null,2558]
[null,null,2559]
[null,null,2560]
[null,null,2561]
[null,null,2562]
[null,null,2563]
[null,null,2564]
[null,null,2565]
[null,null,2566]
[null,null,2567]
[null,null,2568]
[null,null,2569]
[null,null,2570]
[null,null,2571]
[null,null,2572]
[null,null,2573]
[null,null,2574]
[null,null,2575]
[null,null,2576]
[null,null,2577]
[null,null,2578]
[null,null,2579]
[null,null,2580]
[null,null,2581]
[null,null,2582]
[null,null,2583]
[null,null,2584]
[null,null,2585]
[null,null,2586]
[null,null,2587]
[null,null,2588]
[null,null,2589]
[null,null,2590]
[null,null,2591]
[null,null,2592]
[null,null,2593]
[null,null,2594]
[null,null,2595]
[null,null,2596]
[null,null,2597]
[null,null,2598]
[null,null,2599]
[null,null,2600]
[null,null,2601]
[null,null,2602]
[null,null,2603]
[null,null,2604]
[null,null,2605]
[null,null,2606]
[null,null,2607]
[null,null,2608]
[null,null,2609]
[null,null,2610]
[null,null,2611]
[null,null,2612]
[null,null,2613]
[null,null,2614]
[null,null,2615]
[null,null,2616]
[null,null,2617]
[null,null,2618]
[null,null,2619]
[null,null,2620]
[null,null,2621]
[null,null,2622]
[null,null,2623]
[null,null,2624]
[null,null,2625]
[null,null,2626]
[null,null,2627]
[null,null,2628]
[null,null,2629]
[null,null,2630]
[null,null,2631]
[null,null,2632]
[null,null,2633]
[null,null,2634]
[null,null,2635]
[null,null,2636]
[null,null,2637]
[null,null,2638]
[null,null,2639]
[null,null,2640]
[null,null,2641]
[null,null,2642]
[null,null,2643]
[null,null,2644]
[null,null,2645]
[null,null,2646]
[null,null,2647]
[null,null,2648]
[null,null,2649]
[null,null,2650]
[null,null,2651]
[null,null,2652]
[null,null,2653]
[null,null,2654]
[null,null,2655]
[null,null,2656]
[null,null,2657]
[null,null,2658]
[null,null,2659]
[null,null,2660]
[null,null,2661]
[null,null,2662]
[null,null,2663]
[null,null,2664]
[null,null,2665]
[null,null,2666]
[null,null,2667]
[null,null,2668]
[null,null,2669]
[null,null,2670]
[null,null,2671]
[null,null,2672]
[null,null,2673]
[null,null,2674]
[null,null,2675]
[null,null,2676]
[null,null,2677]
[null,null,2678]
[null,null,2679]
[null,null,2680]
[null,null,2681]
[null,null,2682]
[null,null,2683]
[null,null,2684]
[null,null,2685]
[null,null,2686]
[null,null,2687]
[null,null,2688]
[null,null,2689]
[null,null,2690]
[null,null,2691]
[null,null,2692]
[null,null,2693]
[null,null,2694]
[null,null,2695]
[null,null,2696]
[null,null,2697]
[null,null,2698]
[null,null,2699]
[null,null,2700]
[null,null,2701]
[null,null,2702]
[null,null,2703]
[null,null,2704]
[null,null,2705]
[null,null,2706]
[null,null,2707]
[null,null,2708]
[null,null,2709]
[null,null,2710]
[null,null,2711]
[null,null,2712]
[null,null,2713]
[null,null,2714]
[null,null,2715]
[null,null,2716]
[null,null,2717]
[null,null,2718]
[null,null,2719]
[null,null,2720]
[null,null,2721]
[null,null,2722]
[null,null,2723]
[null,null,2724]
[null,null,2725]
[null,null,2726]
[null,null,2727]
[null,null,2728]
[null,null,2729]
[null,null,2730]
[null,null,2731]
[null,null,2732]
[null,null,2733]
[null,null,2734]
[null,null,2735]
[null,null,2736]
[null,null,2737]
[null,null,2738]
[null,null,2739]
[null,null,2740]
[null,null,2741]
[null,null,2742]
[null,null,2743]
[null,null,2744]
[null,null,2745]
[null,null,2746]
[null,null,2747]
[null,null,2748]
[null,null,2749]
[null,null,2750]
[null,null,2751]
[null,null,2752]
[null,null,2753]
[null,null,2754]
[null,null,2755]
[null,null,2756]
[null,null,2757]
[null,null,2758]
[null,null,2759]
[null,null,2760]
[null,null,2761]
[null,null,2762]
[null,null,2763]
[null,null,2764]
[null,null,2765]
[null,null,2766]
[null,null,2767]
[null,null,2768]
[null,null,2769]
[null,null,2770]
[null,null,2771]
[null,null,2772]
[null,null,2773]
[null,null,2774]
[null,null,2775]
[null,null,2776]
[null,null,2777]
[null,null,2778]
[null,null,2779]
[null,null,2780]
[null,null,2781]
[null,null,2782]
[null,null,2783]
[null,null,2784]
[null,null,2785]
[null,null,2786]
[null,null,2787]
[null,null,2788]
[null,null,2789]
[null,null,2790]
[null,null,2791]
[null,null,2792]
[null,null,2793]
[null,null,2794]
[null,null,2795]
[null,null,2796]
[null,null,2797]
[null,null,2798]
[null,null,2799]
[null,null,2800]
[null,null,2801]
[null,null,2802]
[null,null,2803]
[null,null,2804]
[null,null,2805]
[null,null,2806]
[null,null,2807]
[null,null,2808]
[null,null,2809]
[null,null,2810]
[null,null,2811]
[null,null,2812]
[null,null,2813]
[null,null,2814]
[null,null,2815]
[null,null,2816]
[null,null,2817]
[null,null,2818]
[null,null,2819]
[null,null,2820]
[null,null,2821]
[null,null,2822]
[null,null,2823]
[null,null,2824]
[null,null,2825]
[null,null,2826]
[null,null,2827]
[null,null,2828]
[null,null,2829]
[null,null,2830]
[null,null,2831]
[null,null,2832]
[null,null,2833]
[null,null,2834]
[null,null,2835]
[null,null,2836]
[null,null,2837]
[null,null,2838]
[null,null,2839]
[null,null,2840]
[null,null,2841]
[null,null,2842]
[null,null,2843]
[null,null,2844]
[null,null,2845]
[null,null,2846]
[null,null,2847]
[null,null,2848]
[null,null,2849]
[null,null,2850]
[null,null,2851]
[null,null,2852]
[null,null,2853]
[null,null,2854]
[null,null,2855]
[null,null,2856]
[null,null,2857]
[null,null,2858]
[null,null,2859]
[null,null,2860]
[null,null,2861]
[null,null,2862]
[null,null,2863]
[null,null,2864]
[null,null,2865]
[null,null,2866]
[null,null,2867]
[null,null,2868]
[null,null,2869]
[null,null,2870]
[null,null,2871]
[null,null,2872]
[null,null,2873]
[null,null,2874]
[null,null,2875]
[null,null,2876]
[null,null,2877]
[null,null,2878]
[null,null,2879]
[null,null,2880]
[null,null,2881]
[null,null,2882]
[null,null,2883]
[null,null,2884]
[null,null,2885]
[null,null,2886]
[null,null,2887]
[null,null,2888]
[null,null,2889]
[null,null,2890]
[null,null,2891]
[null,null,2892]
[null,null,2893]
[null,null,2894]
[null,null,2895]
[null,null,2896]
[null,null,2897]
[null,null,2898]
[null,null,2899]
[null,null,2900]
[null,null,2901]
[null,null,2902]
[null,null,2903]
[null,null,2904]
[null,null,2905]
[null,null,2906]
[null,null,2907]
[null,null,2908]
[null,null,2909]
[null,null,2910]
[null,null,2911]
[null,null,2912]
[null,null,2913]
[null,null,2914]
[null,null,2915]
[null,null,2916]
[null,null,2917]
[null,null,2918]
[null,null,2919]
[null,null,2920]
[null,null,2921]
[null,null,2922]
[null,null,2923]
[null,null,2924]
[null,null,2925]
[null,null,2926]
[null,null,2927]
[null,null,2928]
[null,null,2929]
[null,null,2930]
[null,null,2931]
[null,null,2932]
[null,null,2933]
[null,null,2934]
[null,null,2935]
[null,null,2936]
[null,null,2937]
[null,null,2938]
[null,null,2939]
[null,null,2940]
[null,null,2941]
[null,null,2942]
[null,null,2943]
[null,null,2944]
[null,null,2945]
[null,null,2946]
[null,null,2947]
[null,null,2948]
[null,null,2949]
[null,null,2950]
[null,null,2951]
[null,null,2952]
[null,null,2953]
[null,null,2954]
[null,null,2955]
[null,null,2956]
[null,null,2957]
[null,null,2958]
[null,null,2959]
[null,null,2960]
[null,null,2961]
[null,null,2962]
[null,null,2963]
[null,null,2964]
[null,null,2965]
[null,null,2966]
[null,null,2967]
[null,null,2968]
[null,null,2969]
[null,null,2970]
[null,null,2971]
[null,null,2972]
[null,null,2973]
[null,null,2974]
[null,null,2975]
[null,null,2976]
[null,null,2977]
[null,null,2978]
[null,null,2979]
[null,null,2980]
[null,null,2981]
[null,null,2982]
[null,null,2983]
[null,null,2984]
[null,null,2985]
[null,null,2986]
[null,null,2987]
[null,null,2988]
[null,null,2989]
[null,null,2990]
[null,null,2991]
[null,null,2992]
[null,null,2993]
[null,null,2994]
[null,null,2995]
[null,null,2996]
[null,null,2997]
[null,null,2998]
[null,null,2999]
[null,null,3000]
[null,null,3001]
[null,null,3002]
[null,null,3003]
[null,null,3004]
[null,null,3005]
[null,null,3006]
[null,null,3007]
[null,null,3008]
[null,null,3009]
[null,null,3010]
[null,null,3011]
[null,null,3012]
[null,null,3013]
[null,null,3014]
[null,null,3015]
[null,null,3016]
[null,null,3017]
[null,null,3018]
[null,null,3019]
[null,null,3020]
[null,null,3021]
[null,null,3022]
[null,null,3023]
[null,null,3024]
[null,null,3025]
[null,null,3026]
[null,null,3027]
[null,null,3028]
[null,null,3029]
[null,null,3030]
[null,null,3031]
[null,null,3032]
[null,null,3033]
[null,null,3034]
[null,null,3035]
[null,null,3036]
[null,null,3037]
[null,null,3038]
[null,null,3039]
[null,null,3040]
[null,null,3041]
[null,null,3042]
[null,null,3043]
[null,null,3044]
[null,null,3045]
[null,null,3046]
[null,null,3047]
[null,null,3048]
[null,null,3049]
[null,null,3050]
[null,null,3051]
[null,null,3052]
[null,null,3053]
[null,null,3054]
[null,null,3055]
[null,null,3056]
[null,null,3057]
[null,null,3058]
[null,null,3059]
[null,null,3060]
[null,null,3061]
[null,null,3062]
[null,null,3063]
[null,null,3064]
[null,null,3065]
[null,null,3066]
[null,null,3067]
[null,null,3068]
[null,null,3069]
[null,null,3070]
[null,null,3071]
[null,null,3072]
[null,null,3073]
[null,null,3074]
[null,null,3075]
[null,null,3076]
[null,null,3077]
[null,null,3078]
[null,null,3079]
[null,null,3080]
[null,null,3081]
[null,null,3082]
[null,null,3083]
[null,null,3084]
[null,null,3085]
[null,null,3086]
[null,null,3087]
[null,null,3088]
[null,null,3089]
[null,null,3090]
[null,null,3091]
[null,null,3092]
[null,null,3093]
[null,null,3094]
[null,null,3095]
[null,null,3096]
[null,null,3097]
[null,null,3098]
[null,null,3099]
[null,null,3100]
[null,null,3101]
[null,null,3102]
[null,null,3103]
[null,null,3104]
[null,null,3105]
[null,null,3106]
[null,null,3107]
[null,null,3108]
[null,null,3109]
[null,null,3110]
[null,null,3111]
[null,null,3112]
[null,null,3113]
[null,null,3114]
[null,null,3115]
[null,null,3116]
[null,null,3117]
[null,null,3118]
[null,null,3119]
[null,null,3120]
[null,null,3121]
[null,null,3122]
[null,null,3123]
[null,null,3124]
[null,null,3125]
[null,null,3126]
[null,null,3127]
[null,null,3128]
[null,null,3129]
[null,null,3130]
[null,null,3131]
[null,null,3132]
[null,null,3133]
[null,null,3134]
[null,null,3135]
[null,null,3136]
[null,null,3137]
[null,null,3138]
[null,null,3139]
[null,null,3140]
[null,null,3141]
[null,null,3142]
[null,null,3143]
[null,null,3144]
[null,null,3145]
[null,null,3146]
[null,null,3147]
[null,null,3148]
[null,null,3149]
[null,null,3150]
[null,null,3151]
[null,null,3152]
[null,null,3153]
[null,null,3154]
[null,null,3155]
[null,null,3156]
[null,null,3157]
[null,null,3158]
[null,null,3159]
[null,null,3160]
[null,null,3161]
[null,null,3162]
[null,null,3163]
[null,null,3164]
[null,null,3165]
[null,null,3166]
[null,null,3167]
[null,null,3168]
[null,null,3169]
[null,null,3170]
[null,null,3171]
[null,null,3172]
[null,null,3173]
[null,null,3174]
[null,null,3175]
[null,null,3176]
[null,null,3177]
[null,null,3178]
[null,null,3179]
[null,null,3180]
[null,null,3181]
[null,null,3182]
[null,null,3183]
[null,null,3184]
[null,null,3185]
[null,null,3186]
[null,null,3187]
[null,null,3188]
[null,null,3189]
[null,null,3190]
[null,null,3191]
[null,null,3192]
[null,null,3193]
[null,null,3194]
[null,null,3195]
[null,null,3196]
[null,null,3197]
[null,null,3198]
[null,null,3199]
[null,null,3200]
[null,null,3201]
[null,null,3202]
[null,null,3203]
[null,null,3204]
[null,null,3205]
[null,null,3206]
[null,null,3207]
[null,null,3208]
[null,null,3209]
[null,null,3210]
[null,null,3211]
[null,null,3212]
[null,null,3213]
[null,null,3214]
[null,null,3215]
[null,null,3216]
[null,null,3217]
[null,null,3218]
[null,null,3219]
[null,null,3220]
[null,null,3221]
[null,null,3222]
[null,null,3223]
[null,null,3224]
[null,null,3225]
[null,null,3226]
[null,null,3227]
[null,null,3228]
[null,null,3229]
[null,null,3230]
[null,null,3231]
[null,null,3232]
[null,null,3233]
[null,null,3234]
[null,null,3235]
[null,null,3236]
[null,null,3237]
[null,null,3238]
[null,null,3239]
[null,null,3240]
[null,null,3241]
[null,null,3242]
[null,null,3243]
[null,null,3244]
[null,null,3245]
[null,null,3246]
[null,null,3247]
[null,null,3248]
[null,null,3249]
[null,null,3250]
[null,null,3251]
[null,null,3252]
[null,null,3253]
[null,null,3254]
[null,null,3255]
[null,null,3256]
[null,null,3257]
[null,null,3258]
[null,null,3259]
[null,null,3260]
[null,null,3261]
[null,null,3262]
[null,null,3263]
[null,null,3264]
[null,null,3265]
[null,null,3266]
[null,null,3267]
[null,null,3268]
[null,null,3269]
[null,null,3270]
[null,null,3271]
[null,null,3272]
[null,null,3273]
[null,null,3274]
[null,null,3275]
[null,null,3276]
[null,null,3277]
[null,null,3278]
[null,null,3279]
[null,null,3280]
[null,null,3281]
[null,null,3282]
[null,null,3283]
[null,null,3284]
[null,null,3285]
[null,null,3286]
[null,null,3287]
[null,null,3288]
[null,null,3289]
[null,null,3290]
[null,null,3291]
[null,null,3292]
[null,null,3293]
[null,null,3294]
[null,null,3295]
[null,null,3296]
[null,null,3297]
[null,null,3298]
[null,null,3299]
[null,null,3300]
[null,null,3301]
[null,null,3302]
[null,null,3303]
[null,null,3304]
[null,null,3305]
[null,null,3306]
[null,null,3307]
[null,null,3308]
[null,null,3309]
[null,null,3310]
[null,null,3311]
[null,null,3312]
[null,null,3313]
[null,null,3314]
[null,null,3315]
[null,null,3316]
[null,null,3317]
[null,null,3318]
[null,null,3319]
[null,null,3320]
[null,null,3321]
[null,null,3322]
[null,null,3323]
[null,null,3324]
[null,null,3325]
[null,null,3326]
[null,null,3327]
[null,null,3328]
[null,null,3329]
[null,null,3330]
[null,null,3331]
[null,null,3332]
[null,null,3333]
[null,null,3334]
[null,null,3335]
[null,null,3336]
[null,null,3337]
[null,null,3338]
[null,null,3339]
[null,null,3340]
[null,null,3341]
[null,null,3342]
[null,null,3343]
[null,null,3344]
[null,null,3345]
[null,null,3346]
[null,null,3347]
[null,null,3348]
[null,null,3349]
[null,null,3350]
[null,null,3351]
[null,null,3352]
[null,null,3353]
[null,null,3354]
[null,null,3355]
[null,null,3356]
[null,null,3357]
[null,null,3358]
[null,null,3359]
[null,null,3360]
[null,null,3361]
[null,null,3362]
[null,null,3363]
[null,null,3364]
[null,null,3365]
[null,null,3366]
[null,null,3367]
[null,null,3368]
[null,null,3369]
[null,null,3370]
[null,null,3371]
[null,null,3372]
[null,null,3373]
[null,null,3374]
[null,null,3375]
[null,null,3376]
[null,null,3377]
[null,null,3378]
[null,null,3379]
[null,null,3380]
[null,null,3381]
[null,null,3382]
[null,null,3383]
[null,null,3384]
[null,null,3385]
[null,null,3386]
[null,null,3387]
[null,null,3388]
[null,null,3389]
[null,null,3390]
[null,null,3391]
[null,null,3392]
[null,null,3393]
[null,null,3394]
[null,null,3395]
[null,null,3396]
[null,null,3397]
[null,null,3398]
[null,null,3399]
[null,null,3400]
[null,null,3401]
[null,null,3402]
[null,null,3403]
[null,null,3404]
[null,null,3405]
[null,null,3406]
[null,null,3407]
[null,null,3408]
[null,null,3409]
[null,null,3410]
[null,null,3411]
[null,null,3412]
[null,null,3413]
[null,null,3414]
[null,null,3415]
[null,null,3416]
[null,null,3417]
[null,null,3418]
[null,null,3419]
[null,null,3420]
[null,null,3421]
[null,null,3422]
[null,null,3423]
[null,null,3424]
[null,null,3425]
[null,null,3426]
[null,null,3427]
[null,null,3428]
[null,null,3429]
[null,null,3430]
[null,null,3431]
[null,null,3432]
[null,null,3433]
[null,null,3434]
[null,null,3435]
[null,null,3436]
[null,null,3437]
[null,null,3438]
[null,null,3439]
[null,null,3440]
[null,null,3441]
[null,null,3442]
[null,null,3443]
[null,null,3444]
[null,null,3445]
[null,null,3446]
[null,null,3447]
[null,null,3448]
[null,null,3449]
[null,null,3450]
[null,null,3451]
[null,null,3452]
[null,null,3453]
[null,null,3454]
[null,null,3455]
[null,null,3456]
[null,null,3457]
[null,null,3458]
[null,null,3459]
[null,null,3460]
[null,null,3461]
[null,null,3462]
[null,null,3463]
[null,null,3464]
[null,null,3465]
[null,null,3466]
[null,null,3467]
[null,null,3468]
[null,null,3469]
[null,null,3470]
[null,null,3471]
[null,null,3472]
[null,null,3473]
[null,null,3474]
[null,null,3475]
[null,null,3476]
[null,null,3477]
[null,null,3478]
[null,null,3479]
[null,null,3480]
[null,null,3481]
[null,null,3482]
[null,null,3483]
[null,null,3484]
[null,null,3485]
[null,null,3486]
[null,null,3487]
[null,null,3488]
[null,null,3489]
[null,null,3490]
[null,null,3491]
[null,null,3492]
[null,null,3493]
[null,null,3494]
[null,null,3495]
[null,null,3496]
[null,null,3497]
[null,null,3498]
[null,null,3499]
[null,null,3500]
[null,null,3501]
[null,null,3502]
[null,null,3503]
[null,null,3504]
[null,null,3505]
[null,null,3506]
[null,null,3507]
[null,null,3508]
[null,null,3509]
[null,null,3510]
[null,null,3511]
[null,null,3512]
[null,null,3513]
[null,null,3514]
[null,null,3515]
[null,null,3516]
[null,null,3517]
[null,null,3518]
[null,null,3519]
[null,null,3520]
[null,null,3521]
[null,null,3522]
[null,null,3523]
[null,null,3524]
[null,null,3525]
[null,null,3526]
[null,null,3527]
[null,null,3528]
[null,null,3529]
[null,null,3530]
[null,null,3531]
[null,null,3532]
[null,null,3533]
[null,null,3534]
[null,null,3535]
[null,null,3536]
[null,null,3537]
[null,null,3538]
[null,null,3539]
[null,null,3540]
[null,null,3541]
[null,null,3542]
[null,null,3543]
[null,null,3544]
[null,null,3545]
[null,null,3546]
[null,null,3547]
[null,null,3548]
[null,null,3549]
[null,null,3550]
[null,null,3551]
[null,null,3552]
[null,null,3553]
[null,null,3554]
[null,null,3555]
[null,null,3556]
[null,null,3557]
[null,null,3558]
[null,null,3559]
[null,null,3560]
[null,null,3561]
[null,null,3562]
[null,null,3563]
[null,null,3564]
[null,null,3565]
[null,null,3566]
[null,null,3567]
[null,null,3568]
[null,null,3569]
[null,null,3570]
[null,null,3571]
[null,null,3572]
[null,null,3573]
[null,null,3574]
[null,null,3575]
[null,null,3576]
[null,null,3577]
[null,null,3578]
[null,null,3579]
[null,null,3580]
[null,null,3581]
[null,null,3582]
[null,null,3583]
[null,null,3584]
[null,null,3585]
[null,null,3586]
[null,null,3587]
[null,null,3588]
[null,null,3589]
[null,null,3590]
[null,null,3591]
[null,null,3592]
[null,null,3593]
[null,null,3594]
[null,null,3595]
[null,null,3596]
[null,null,3597]
[null,null,3598]
[null,null,3599]
[null,null,3600]
[null,null,3601]
[null,null,3602]
[null,null,3603]
[null,null,3604]
[null,null,3605]
[null,null,3606]
[null,null,3607]
[null,null,3608]
[null,null,3609]
[null,null,3610]
[null,null,3611]
[null,null,3612]
[null,null,3613]
[null,null,3614]
[null,null,3615]
[null,null,3616]
[null,null,3617]
[null,null,3618]
[null,null,3619]
[null,null,3620]
[null,null,3621]
[null,null,3622]
[null,null,3623]
[null,null,3624]
[null,null,3625]
[null,null,3626]
[null,null,3627]
[null,null,3628]
[null,null,3629]
[null,null,3630]
[null,null,3631]
[null,null,3632]
[null,null,3633]
[null,null,3634]
[null,null,3635]
[null,null,3636]
[null,null,3637]
[null,null,3638]
[null,null,3639]
[null,null,3640]
[null,null,3641]
[null,null,3642]
[null,null,3643]
[null,null,3644]
[null,null,3645]
[null,null,3646]
[null,null,3647]
[null,null,3648]
[null,null,3649]
[null,null,3650]
[null,null,3651]
[null,null,3652]
[null,null,3653]
[null,null,3654]
[null,null,3655]
[null,null,3656]
[null,null,3657]
[null,null,3658]
[null,null,3659]
[null,null,3660]
[null,null,3661]
[null,null,3662]
[null,null,3663]
[null,null,3664]
[null,null,3665]
[null,null,3666]
[null,null,3667]
[null,null,3668]
[null,null,3669]
[null,null,3670]
[null,null,3671]
[null,null,3672]
[null,null,3673]
[null,null,3674]
[null,null,3675]
[null,null,3676]
[null,null,3677]
[null,null,3678]
[null,null,3679]
[null,null,3680]
[null,null,3681]
[null,null,3682]
[null,null,3683]
[null,null,3684]
[null,null,3685]
[null,null,3686]
[null,null,3687]
[null,null,3688]
[null,null,3689]
[null,null,3690]
[null,null,3691]
[null,null,3692]
[null,null,3693]
[null,null,3694]
[null,null,3695]
[null,null,3696]
[null,null,3697]
[null,null,3698]
[null,null,3699]
[null,null,3700]
[null,null,3701]
[null,null,3702]
[null,null,3703]
[null,null,3704]
[null,null,3705]
[null,null,3706]
[null,null,3707]
[null,null,3708]
[null,null,3709]
[null,null,3710]
[null,null,3711]
[null,null,3712]
[null,null,3713]
[null,null,3714]
[null,null,3715]
[null,null,3716]
[null,null,3717]
[null,null,3718]
[null,null,3719]
[null,null,3720]
[null,null,3721]
[null,null,3722]
[null,null,3723]
[null,null,3724]
[null,null,3725]
[null,null,3726]
[null,null,3727]
[null,null,3728]
[null,null,3729]
[null,null,3730]
[null,null,3731]
[null,null,3732]
[null,null,3733]
[null,null,3734]
[null,null,3735]
[null,null,3736]
[null,null,3737]
[null,null,3738]
[null,null,3739]
[null,null,3740]
[null,null,3741]
[null,null,3742]
[null,null,3743]
[null,null,3744]
[null,null,3745]
[null,null,3746]
[null,null,3747]
[null,null,3748]
[null,null,3749]
[null,null,3750]
[null,null,3751]
[null,null,3752]
[null,null,3753]
[null,null,3754]
[null,null,3755]
[null,null,3756]
[null,null,3757]
[null,null,3758]
[null,null,3759]
[null,null,3760]
[null,null,3761]
[null,null,3762]
[null,null,3763]
[null,null,3764]
[null,null,3765]
[null,null,3766]
[null,null,3767]
[null,null,3768]
[null,null,3769]
[null,null,3770]
[null,null,3771]
[null,null,3772]
[null,null,3773]
[null,null,3774]
[null,null,3775]
[null,null,3776]
[null,null,3777]
[null,null,3778]
[null,null,3779]
[null,null,3780]
[null,null,3781]
[null,null,3782]
[null,null,3783]
[null,null,3784]
[null,null,3785]
[null,null,3786]
[null,null,3787]
[null,null,3788]
[null,null,3789]
[null,null,3790]
[null,null,3791]
[null,null,3792]
[null,null,3793]
[null,null,3794]
[null,null,3795]
[null,null,3796]
[null,null,3797]
[null,null,3798]
[null,null,3799]
[null,null,3800]
[null,null,3801]
[null,null,3802]
[null,null,3803]
[null,null,3804]
[null,null,3805]
[null,null,3806]
[null,null,3807]
[null,null,3808]
[null,null,3809]
[null,null,3810]
[null,null,3811]
[null,null,3812]
[null,null,3813]
[null,null,3814]
[null,null,3815]
[null,null,3816]
[null,null,3817]
[null,null,3818]
[null,null,3819]
[null,null,3820]
[null,null,3821]
[null,null,3822]
[null,null,3823]
[null,null,3824]
[null,null,3825]
[null,null,3826]
[null,null,3827]
[null,null,3828]
[null,null,3829]
[null,null,3830]
[null,null,3831]
[null,null,3832]
[null,null,3833]
[null,null,3834]
[null,null,3835]
[null,null,3836]
[null,null,3837]
[null,null,3838]
[null,null,3839]
[null,null,3840]
[null,null,3841]
[null,null,3842]
[null,null,3843]
[null,null,3844]
[null,null,3845]
[null,null,3846]
[null,null,3847]
[null,null,3848]
[null,null,3849]
[null,null,3850]
[null,null,3851]
[null,null,3852]
[null,null,3853]
[null,null,3854]
[null,null,3855]
[null,null,3856]
[null,null,3857]
[null,null,3858]
[null,null,3859]
[null,null,3860]
[null,null,3861]
[null,null,3862]
[null,null,3863]
[null,null,3864]
[null,null,3865]
[null,null,3866]
[null,null,3867]
[null,null,3868]
[null,null,3869]
[null,null,3870]
[null,null,3871]
[null,null,3872]
[null,null,3873]
[null,null,3874]
[null,null,3875]
[null,null,3876]
[null,null,3877]
[null,null,3878]
[null,null,3879]
[null,null,3880]
[null,null,3881]
[null,null,3882]
[null,null,3883]
[null,null,3884]
[null,null,3885]
[null,null,3886]
[null,null,3887]
[null,null,3888]
[null,null,3889]
[null,null,3890]
[null,null,3891]
[null,null,3892]
[null,null,3893]
[null,null,3894]
[null,null,3895]
[null,null,3896]
[null,null,3897]
[null,null,3898]
[null,null,3899]
[null,null,3900]
[null,null,3901]
[null,null,3902]
[null,null,3903]
[null,null,3904]
[null,null,3905]
[null,null,3906]
[null,null,3907]
[null,null,3908]
[null,null,3909]
[null,null,3910]
[null,null,3911]
[null,null,3912]
[null,null,3913]
[null,null,3914]
[null,null,3915]
[null,null,3916]
[null,null,3917]
[null,null,3918]
[null,null,3919]
[null,null,3920]
[null,null,3921]
[null,null,3922]
[null,null,3923]
[null,null,3924]
[null,null,3925]
[null,null,3926]
[null,null,3927]
[null,null,3928]
[null,null,3929]
[null,null,3930]
[null,null,3931]
[null,null,3932]
[null,null,3933]
[null,null,3934]
[null,null,3935]
[null,null,3936]
[null,null,3937]
[null,null,3938]
[null,null,3939]
[null,null,3940]
[null,null,3941]
[null,null,3942]
[null,null,3943]
[null,null,3944]
[null,null,3945]
[null,null,3946]
[null,null,3947]
[null,null,3948]
[null,null,3949]
[null,null,3950]
[null,null,3951]
[null,null,3952]
[null,null,3953]
[null,null,3954]
[null,null,3955]
[null,null,3956]
[null,null,3957]
[null,null,3958]
[null,null,3959]
[null,null,3960]
[null,null,3961]
[null,null,3962]
[null,null,3963]
[null,null,3964]
[null,null,3965]
[null,null,3966]
[null,null,3967]
[null,null,3968]
[null,null,3969]
[null,null,3970]
[null,null,3971]
[null,null,3972]
[null,null,3973]
[null,null,3974]
[null,null,3975]
[null,null,3976]
[null,null,3977]
[null,null,3978]
[null,null,3979]
[null,null,3980]
[null,null,3981]
[null,null,3982]
[null,null,3983]
[null,null,3984]
[null,null,3985]
[null,null,3986]
[null,null,3987]
[null,null,3988]
[null,null,3989]
[null,null,3990]
[null,null,3991]
[null,null,3992]
[null,null,3993]
[null,null,3994]
[null,null,3995]
[null,null,3996]
[null,null,3997]
[null,null,3998]
[null,null,3999]
[null,null,4000]
[null,null,4001]
[null,null,4002]
[null,null,4003]
[null,null,4004]
[null,null,4005]
[null,null,4006]
[null,null,4007]
[null,null,4008]
[null,null,4009]
[null,null,4010]
[null,null,4011]
[null,null,4012]
[null,null,4013]
[null,null,4014]
[null,null,4015]
[null,null,4016]
[null,null,4017]
[null,null,4018]
[null,null,4019]
[null,null,4020]
[null,null,4021]
[null,null,4022]
[null,null,4023]
[null,null,4024]
[null,null,4025]
[null,null,4026]
[null,null,4027]
[null,null,4028]
[null,null,4029]
[null,null,4030]
[null,null,4031]
[null,null,4032]
[null,null,4033]
[null,null,4034]
[null,null,4035]
[null,null,4036]
[null,null,4037]
[null,null,4038]
[null,null,4039]
[null,null,4040]
[null,null,4041]
[null,null,4042]
[null,null,4043]
[null,null,4044]
[null,null,4045]
[null,null,4046]
[null,null,4047]
[null,null,4048]
[null,null,4049]
[null,null,4050]
[null,null,4051]
[null,null,4052]
[null,null,4053]
[null,null,4054]
[null,null,4055]
[null,null,4056]
[null,null,4057]
[null,null,4058]
[null,null,4059]
[null,null,4060]
[null,null,4061]
[null,null,4062]
[null,null,4063]
[null,null,4064]
[null,null,4065]
[null,null,4066]
[null,null,4067]
[null,null,4068]
[null,null,4069]
[null,null,4070]
[null,null,4071]
[null,null,4072]
[null,null,4073]
[null,null,4074]
[null,null,4075]
[null,null,4076]
[null,null,4077]
[null,null,4078]
[null,null,4079]
[null,null,4080]
[null,null,4081]
[null,null,4082]
[null,null,4083]
[null,null,4084]
[null,null,4085]
[null,null,4086]
[null,null,4087]
[null,null,4088]
[null,null,4089]
[null,null,4090]
[null,null,4091]
[null,null,4092]
[null,null,4093]
[null,null,4094]
[null,null,4095]
[null,null,4096]
[null,null,4097]
[null,null,4098]
[null,null,4099]
[null,null,4100]
[null,null,4101]
[null,null,4102]
[null,null,4103]
[null,null,4104]
[null,null,4105]
[null,null,4106]
[null,null,4107]
[null,null,4108]
[null,null,4109]
[null,null,4110]
[null,null,4111]
[null,null,4112]
[null,null,4113]
[null,null,4114]
[null,null,4115]
[null,null,4116]
[null,null,4117]
[null,null,4118]
[null,null,4119]
[null,null,4120]
[null,null,4121]
[null,null,4122]
[null,null,4123]
[null,null,4124]
[null,null,4125]
[null,null,4126]
[null,null,4127]
[null,null,4128]
[null,null,4129]
[null,null,4130]
[null,null,4131]
[null,null,4132]
[null,null,4133]
[null,null,4134]
[null,null,4135]
[null,null,4136]
[null,null,4137]
[null,null,4138]
[null,null,4139]
[null,null,4140]
[null,null,4141]
[null,null,4142]
[null,null,4143]
[null,null,4144]
[null,null,4145]
[null,null,4146]
[null,null,4147]
[null,null,4148]
[null,null,4149]
[null,null,4150]
[null,null,4151]
[null,null,4152]
[null,null,4153]
[null,null,4154]
[null,null,4155]
[null,null,4156]
[null,null,4157]
[null,null,4158]
[null,null,4159]
[null,null,4160]
[null,null,4161]
[null,null,4162]
[null,null,4163]
[null,null,4164]
[null,null,4165]
[null,null,4166]
[null,null,4167]
[null,null,4168]
[null,null,4169]
[null,null,4170]
[null,null,4171]
[null,null,4172]
[null,null,4173]
[null,null,4174]
[null,null,4175]
[null,null,4176]
[null,null,4177]
[null,null,4178]
[null,null,4179]
[null,null,4180]
[null,null,4181]
[null,null,4182]
[null,null,4183]
[null,null,4184]
[null,null,4185]
[null,null,4186]
[null,null,4187]
[null,null,4188]
[null,null,4189]
[null,null,4190]
[null,null,4191]
[null,null,4192]
[null,null,4193]
[null,null,4194]
[null,null,4195]
[null,null,4196]
[null,null,4197]
[null,null,4198]
[null,null,4199]
[null,null,4200]
[null,null,4201]
[null,null,4202]
[null,null,4203]
[null,null,4204]
[null,null,4205]
[null,null,4206]
[null,null,4207]
[null,null,4208]
[null,null,4209]
[null,null,4210]
[null,null,4211]
[null,null,4212]
[null,null,4213]
[null,null,4214]
[null,null,4215]
[null,null,4216]
[null,null,4217]
[null,null,4218]
[null,null,4219]
[null,null,4220]
[null,null,4221]
[null,null,4222]
[null,null,4223]
[null,null,4224]
[null,null,4225]
[null,null,4226]
[null,null,4227]
[null,null,4228]
[null,null,4229]
[null,null,4230]
[null,null,4231]
[null,null,4232]
[null,null,4233]
[null,null,4234]
[null,null,4235]
[null,null,4236]
[null,null,4237]
[null,null,4238]
[null,null,4239]
[null,null,4240]
[null,null,4241]
[null,null,4242]
[null,null,4243]
[null,null,4244]
[null,null,4245]
[null,null,4246]
[null,null,4247]
[null,null,4248]
[null,null,4249]
[null,null,4250]
[null,null,4251]
[null,null,4252]
[null,null,4253]
[null,null,4254]
[null,null,4255]
[null,null,4256]
[null,null,4257]
[null,null,4258]
[null,null,4259]
[null,null,4260]
[null,null,4261]
[null,null,4262]
[null,null,4263]
[null,null,4264]
[null,null,4265]
[null,null,4266]
[null,null,4267]
[null,null,4268]
[null,null,4269]
[null,null,4270]
[null,null,4271]
[null,null,4272]
[null,null,4273]
[null,null,4274]
[null,null,4275]
[null,null,4276]
[null,null,4277]
[null,null,4278]
[null,null,4279]
[null,null,4280]
[null,null,4281]
[null,null,4282]
[null,null,4283]
[null,null,4284]
[null,null,4285]
[null,null,4286]
[null,null,4287]
[null,null,4288]
[null,null,4289]
[null,null,4290]
[null,null,4291]
[null,null,4292]
[null,null,4293]
[null,null,4294]
[null,null,4295]
[null,null,4296]
[null,null,4297]
[null,null,4298]
[null,null,4299]
[null,null,4300]
[null,null,4301]
[null,null,4302]
[null,null,4303]
[null,null,4304]
[null,null,4305]
[null,null,4306]
[null,null,4307]
[null,null,4308]
[null,null,4309]
[null,null,4310]
[null,null,4311]
[null,null,4312]
[null,null,4313]
[null,null,4314]
[null,null,4315]
[null,null,4316]
[null,null,4317]
[null,null,4318]
[null,null,4319]
[null,null,4320]
[null,null,4321]
[null,null,4322]
[null,null,4323]
[null,null,4324]
[null,null,4325]
[null,null,4326]
[null,null,4327]
[null,null,4328]
[null,null,4329]
[null,null,4330]
[null,null,4331]
[null,null,4332]
[null,null,4333]
[null,null,4334]
[null,null,4335]
[null,null,4336]
[null,null,4337]
[null,null,4338]
[null,null,4339]
[null,null,4340]
[null,null,4341]
[null,null,4342]
[null,null,4343]
[null,null,4344]
[null,null,4345]
[null,null,4346]
[null,null,4347]
[null,null,4348]
[null,null,4349]
[null,null,4350]
[null,null,4351]
[null,null,4352]
[null,null,4353]
[null,null,4354]
[null,null,4355]
[null,null,4356]
[null,null,4357]
[null,null,4358]
[null,null,4359]
[null,null,4360]
[null,null,4361]
[null,null,4362]
[null,null,4363]
[null,null,4364]
[null,null,4365]
[null,null,4366]
[null,null,4367]
[null,null,4368]
[null,null,4369]
[null,null,4370]
[null,null,4371]
[null,null,4372]
[null,null,4373]
[null,null,4374]
[null,null,4375]
[null,null,4376]
[null,null,4377]
[null,null,4378]
[null,null,4379]
[null,null,4380]
[null,null,4381]
[null,null,4382]
[null,null,4383]
[null,null,4384]
[null,null,4385]
[null,null,4386]
[null,null,4387]
[null,null,4388]
[null,null,4389]
[null,null,4390]
[null,null,4391]
[null,null,4392]
[null,null,4393]
[null,null,4394]
[null,null,4395]
[null,null,4396]
[null,null,4397]
[null,null,4398]
[null,null,4399]
[null,null,4400]
[null,null,4401]
[null,null,4402]
[null,null,4403]
[null,null,4404]
[null,null,4405]
[null,null,4406]
[null,null,4407]
[null,null,4408]
[null,null,4409]
[null,null,4410]
[null,null,4411]
[null,null,4412]
[null,null,4413]
[null,null,4414]
[null,null,4415]
[null,null,4416]
[null,null,4417]
[null,null,4418]
[null,null,4419]
[null,null,4420]
[null,null,4421]
[null,null,4422]
[null,null,4423]
[null,null,4424]
[null,null,4425]
[null,null,4426]
[null,null,4427]
[null,null,4428]
[null,null,4429]
[null,null,4430]
[null,null,4431]
[null,null,4432]
[null,null,4433]
[null,null,4434]
[null,null,4435]
[null,null,4436]
[null,null,4437]
[null,null,4438]
[null,null,4439]
[null,null,4440]
[null,null,4441]
[null,null,4442]
[null,null,4443]
[null,null,4444]
[null,null,4445]
[null,null,4446]
[null,null,4447]
[null,null,4448]
[null,null,4449]
[null,null,4450]
[null,null,4451]
[null,null,4452]
[null,null,4453]
[null,null,4454]
[null,null,4455]
[null,null,4456]
[null,null,4457]
[null,null,4458]
[null,null,4459]
[null,null,4460]
[null,null,4461]
[null,null,4462]
[null,null,4463]
[null,null,4464]
[null,null,4465]
[null,null,4466]
[null,null,4467]
[null,null,4468]
[null,null,4469]
[null,null,4470]
[null,null,4471]
[null,null,4472]
[null,null,4473]
[null,null,4474]
[null,null,4475]
[null,null,4476]
[null,null,4477]
[null,null,4478]
[null,null,4479]
[null,null,4480]
[null,null,4481]
[null,null,4482]
[null,null,4483]
[null,null,4484]
[null,null,4485]
[null,null,4486]
[null,null,4487]
[null,null,4488]
[null,null,4489]
[null,null,4490]
[null,null,4491]
[null,null,4492]
[null,null,4493]
[null,null,4494]
[null,null,4495]
[null,null,4496]
[null,null,4497]
[null,null,4498]
[null,null,4499]
[null,null,4500]
[null,null,4501]
[null,null,4502]
[null,null,4503]
[null,null,4504]
[null,null,4505]
[null,null,4506]
[null,null,4507]
[null,null,4508]
[null,null,4509]
[null,null,4510]
[null,null,4511]
[null,null,4512]
[null,null,4513]
[null,null,4514]
[null,null,4515]
[null,null,4516]
[null,null,4517]
[null,null,4518]
[null,null,4519]
[null,null,4520]
[null,null,4521]
[null,null,4522]
[null,null,4523]
[null,null,4524]
[null,null,4525]
[null,null,4526]
[null,null,4527]
[null,null,4528]
[null,null,4529]
[null,null,4530]
[null,null,4531]
[null,null,4532]
[null,null,4533]
[null,null,4534]
[null,null,4535]
[null,null,4536]
[null,null,4537]
[null,null,4538]
[null,null,4539]
[null,null,4540]
[null,null,4541]
[null,null,4542]
[null,null,4543]
[null,null,4544]
[null,null,4545]
[null,null,4546]
[null,null,4547]
[null,null,4548]
[null,null,4549]
[null,null,4550]
[null,null,4551]
[null,null,4552]
[null,null,4553]
[null,null,4554]
[null,null,4555]
[null,null,4556]
[null,null,4557]
[null,null,4558]
[null,null,4559]
[null,null,4560]
[null,null,4561]
[null,null,4562]
[null,null,4563]
[null,null,4564]
[null,null,4565]
[null,null,4566]
[null,null,4567]
[null,null,4568]
[null,null,4569]
[null,null,4570]
[null,null,4571]
[null,null,4572]
[null,null,4573]
[null,null,4574]
[null,null,4575]
[null,null,4576]
[null,null,4577]
[null,null,4578]
[null,null,4579]
[null,null,4580]
[null,null,4581]
[null,null,4582]
[null,null,4583]
[null,null,4584]
[null,null,4585]
[null,null,4586]
[null,null,4587]
[null,null,4588]
[null,null,4589]
[null,null,4590]
[null,null,4591]
[null,null,4592]
[null,null,4593]
[null,null,4594]
[null,null,4595]
[null,null,4596]
[null,null,4597]
[null,null,4598]
[null,null,4599]
[null,null,4600]
[null,null,4601]
[null,null,4602]
[null,null,4603]
[null,null,4604]
[null,null,4605]
[null,null,4606]
[null,null,4607]
[null,null,4608]
[null,null,4609]
[null,null,4610]
[null,null,4611]
[null,null,4612]
[null,null,4613]
[null,null,4614]
[null,null,4615]
[null,null,4616]
[null,null,4617]
[null,null,4618]
[null,null,4619]
[null,null,4620]
[null,null,4621]
[null,null,4622]
[null,null,4623]
[null,null,4624]
[null,null,4625]
[null,null,4626]
[null,null,4627]
[null,null,4628]
[null,null,4629]
[null,null,4630]
[null,null,4631]
[null,null,4632]
[null,null,4633]
[null,null,4634]
[null,null,4635]
[null,null,4636]
[null,null,4637]
[null,null,4638]
[null,null,4639]
[null,null,4640]
[null,null,4641]
[null,null,4642]
[null,null,4643]
[null,null,4644]
[null,null,4645]
[null,null,4646]
[null,null,4647]
[null,null,4648]
[null,null,4649]
[null,null,4650]
[null,null,4651]
[null,null,4652]
[null,null,4653]
[null,null,4654]
[null,null,4655]
[null,null,4656]
[null,null,4657]
[null,null,4658]
[null,null,4659]
[null,null,4660]
[null,null,4661]
[null,null,4662]
[null,null,4663]
[null,null,4664]
[null,null,4665]
[null,null,4666]
[null,null,4667]
[null,null,4668]
[null,null,4669]
[null,null,4670]
[null,null,4671]
[null,null,4672]
[null,null,4673]
[null,null,4674]
[null,null,4675]
[null,null,4676]
[null,null,4677]
[null,null,4678]
[null,null,4679]
[null,null,4680]
[null,null,4681]
[null,null,4682]
[null,null,4683]
[null,null,4684]
[null,null,4685]
[null,null,4686]
[null,null,4687]
[null,null,4688]
[null,null,4689]
[null,null,4690]
[null,null,4691]
[null,null,4692]
[null,null,4693]
[null,null,4694]
[null,null,4695]
[null,null,4696]
[null,null,4697]
[null,null,4698]
[null,null,4699]
[null,null,4700]
[null,null,4701]
[null,null,4702]
[null,null,4703]
[null,null,4704]
[null,null,4705]
[null,null,4706]
[null,null,4707]
[null,null,4708]
[null,null,4709]
[null,null,4710]
[null,null,4711]
[null,null,4712]
[null,null,4713]
[null,null,4714]
[null,null,4715]
[null,null,4716]
[null,null,4717]
[null,null,4718]
[null,null,4719]
[null,null,4720]
[null,null,4721]
[null,null,4722]
[null,null,4723]
[null,null,4724]
[null,null,4725]
[null,null,4726]
[null,null,4727]
[null,null,4728]
[null,null,4729]
[null,null,4730]
[null,null,4731]
[null,null,4732]
[null,null,4733]
[null,null,4734]
[null,null,4735]
[null,null,4736]
[null,null,4737]
[null,null,4738]
[null,null,4739]
[null,null,4740]
[null,null,4741]
[null,null,4742]
[null,null,4743]
[null,null,4744]
[null,null,4745]
[null,null,4746]
[null,null,4747]
[null,null,4748]
[null,null,4749]
[null,null,4750]
[null,null,4751]
[null,null,4752]
[null,null,4753]
[null,null,4754]
[null,null,4755]
[null,null,4756]
[null,null,4757]
[null,null,4758]
[null,null,4759]
[null,null,4760]
[null,null,4761]
[null,null,4762]
[null,null,4763]
[null,null,4764]
[null,null,4765]
[null,null,4766]
[null,null,4767]
[null,null,4768]
[null,null,4769]
[null,null,4770]
[null,null,4771]
[null,null,4772]
[null,null,4773]
[null,null,4774]
[null,null,4775]
[null,null,4776]
[null,null,4777]
[null,null,4778]
[null,null,4779]
[null,null,4780]
[null,null,4781]
[null,null,4782]
[null,null,4783]
[null,null,4784]
[null,null,4785]
[null,null,4786]
[null,null,4787]
[null,null,4788]
[null,null,4789]
[null,null,4790]
[null,null,4791]
[null,null,4792]
[null,null,4793]
[null,null,4794]
[null,null,4795]
[null,null,4796]
[null,null,4797]
[null,null,4798]
[null,null,4799]
[null,null,4800]
[null,null,4801]
[null,null,4802]
[null,null,4803]
[null,null,4804]
[null,null,4805]
[null,null,4806]
[null,null,4807]
[null,null,4808]
[null,null,4809]
[null,null,4810]
[null,null,4811]
[null,null,4812]
[null,null,4813]
[null,null,4814]
[null,null,4815]
[null,null,4816]
[null,null,4817]
[null,null,4818]
[null,null,4819]
[null,null,4820]
[null,null,4821]
[null,null,4822]
[null,null,4823]
[null,null,4824]
[null,null,4825]
[null,null,4826]
[null,null,4827]
[null,null,4828]
[null,null,4829]
[null,null,4830]
[null,null,4831]
[null,null,4832]
[null,null,4833]
[null,null,4834]
[null,null,4835]
[null,null,4836]
[null,null,4837]
[null,null,4838]
[null,null,4839]
[null,null,4840]
[null,null,4841]
[null,null,4842]
[null,null,4843]
[null,null,4844]
[null,null,4845]
[null,null,4846]
[null,null,4847]
[null,null,4848]
[null,null,4849]
[null,null,4850]
[null,null,4851]
[null,null,4852]
[null,null,4853]
[null,null,4854]
[null,null,4855]
[null,null,4856]
[null,null,4857]
[null,null,4858]
[null,null,4859]
[null,null,4860]
[null,null,4861]
[null,null,4862]
[null,null,4863]
[null,null,4864]
[null,null,4865]
[null,null,4866]
[null,null,4867]
[null,null,4868]
[null,null,4869]
[null,null,4870]
[null,null,4871]
[null,null,4872]
[null,null,4873]
[null,null,4874]
[null,null,4875]
[null,null,4876]
[null,null,4877]
[null,null,4878]
[null,null,4879]
[null,null,4880]
[null,null,4881]
[null,null,4882]
[null,null,4883]
[null,null,4884]
[null,null,4885]
[null,null,4886]
[null,null,4887]
[null,null,4888]
[null,null,4889]
[null,null,4890]
[null,null,4891]
[null,null,4892]
[null,null,4893]
[null,null,4894]
[null,null,4895]
[null,null,4896]
[null,null,4897]
[null,null,4898]
[null,null,4899]
[null,null,4900]
[null,null,4901]
[null,null,4902]
[null,null,4903]
[null,null,4904]
[null,null,4905]
[null,null,4906]
[null,null,4907]
[null,null,4908]
[null,null,4909]
[null,null,4910]
[null,null,4911]
[null,null,4912]
[null,null,4913]
[null,null,4914]
[null,null,4915]
[null,null,4916]
[null,null,4917]
[null,null,4918]
[null,null,4919]
[null,null,4920]
[null,null,4921]
[null,null,4922]
[null,null,4923]
[null,null,4924]
[null,null,4925]
[null,null,4926]
[null,null,4927]
[null,null,4928]
[null,null,4929]
[null,null,4930]
[null,null,4931]
[null,null,4932]
[null,null,4933]
[null,null,4934]
[null,null,4935]
[null,null,4936]
[null,null,4937]
[null,null,4938]
[null,null,4939]
[null,null,4940]
[null,null,4941]
[null,null,4942]
[null,null,4943]
[null,null,4944]
[null,null,4945]
[null,null,4946]
[null,null,4947]
[null,null,4948]
[null,null,4949]
[null,null,4950]
[null,null,4951]
[null,null,4952]
[null,null,4953]
[null,null,4954]
[null,null,4955]
[null,null,4956]
[null,null,4957]
[null,null,4958]
[null,null,4959]
[null,null,4960]
[null,null,4961]
[null,null,4962]
[null,null,4963]
[null,null,4964]
[null,null,4965]
[null,null,4966]
[null,null,4967]
[null,null,4968]
[null,null,4969]
[null,null,4970]
[null,null,4971]
[null,null,4972]
[null,null,4973]
[null,null,4974]
[null,null,4975]
[null,null,4976]
[null,null,4977]
[null,null,4978]
[null,null,4979]
[null,null,4980]
[null,null,4981]
[null,null,4982]
[null,null,4983]
[null,null,4984]
[null,null,4985]
[null,null,4986]
[null,null,4987]
[null,null,4988]
[null,null,4989]
[null,null,4990]
[null,null,4991]
[null,null,4992]
[null,null,4993]
[null,null,4994]
[null,null,4995]
[null,null,4996]
[null,null,4997]
[null,null,4998]
[null,null,4999]
[null,null,5000]
[null,null,5001]
[null,null,5002]
[null,null,5003]
[null,null,5004]
[null,null,5005]
[null,null,5006]
[null,null,5007]
[null,null,5008]
[null,null,5009]
[null,null,5010]
[null,null,5011]
[null,null,5012]
[null,null,5013]
[null,null,5014]
[null,null,5015]
[null,null,5016]
[null,null,5017]
[null,null,5018]
[null,null,5019]
[null,null,5020]
[null,null,5021]
[null,null,5022]
[null,null,5023]
[null,null,5024]
[null,null,5025]
[null,null,5026]
[null,null,5027]
[null,null,5028]
[null,null,5029]
[null,null,5030]
[null,null,5031]
[null,null,5032]
[null,null,5033]
[null,null,5034]
[null,null,5035]
[null,null,5036]
[null,null,5037]
[null,null,5038]
[null,null,5039]
[null,null,5040]
[null,null,5041]
[null,null,5042]
[null,null,5043]
[null,null,5044]
[null,null,5045]
[null,null,5046]
[null,null,5047]
[null,null,5048]
[null,null,5049]
[null,null,5050]
[null,null,5051]
[null,null,5052]
[null,null,5053]
[null,null,5054]
[null,null,5055]
[null,null,5056]
[null,null,5057]
[null,null,5058]
[null,null,5059]
[null,null,5060]
[null,null,5061]
[null,null,5062]
[null,null,5063]
[null,null,5064]
[null,null,5065]
[null,null,5066]
[null,null,5067]
[null,null,5068]
[null,null,5069]
[null,null,5070]
[null,null,5071]
[null,null,5072]
[null,null,5073]
[null,null,5074]
[null,null,5075]
[null,null,5076]
[null,null,5077]
[null,null,5078]
[null,null,5079]
[null,null,5080]
[null,null,5081]
[null,null,5082]
[null,null,5083]
[null,null,5084]
[null,null,5085]
[null,null,5086]
[null,null,5087]
[null,null,5088]
[null,null,5089]
[null,null,5090]
[null,null,5091]
[null,null,5092]
[null,null,5093]
[null,null,5094]
[null,null,5095]
[null,null,5096]
[null,null,5097]
[null,null,5098]
[null,null,5099]
[null,null,5100]
[null,null,5101]
[null,null,5102]
[null,null,5103]
[null,null,5104]
[null,null,5105]
[null,null,5106]
[null,null,5107]
[null,null,5108]
[null,null,5109]
[null,null,5110]
[null,null,5111]
[null,null,5112]
[null,null,5113]
[null,null,5114]
[null,null,5115]
[null,null,5116]
[null,null,5117]
[null,null,5118]
[null,null,5119]
[null,null,5120]
[null,null,5121]
[null,null,5122]
[null,null,5123]
[null,null,5124]
[null,null,5125]
[null,null,5126]
[null,null,5127]
[null,null,5128]
[null,null,5129]
[null,null,5130]
[null,null,5131]
[null,null,5132]
[null,null,5133]
[null,null,5134]
[null,null,5135]
[null,null,5136]
[null,null,5137]
[null,null,5138]
[null,null,5139]
[null,null,5140]
[null,null,5141]
[null,null,5142]
[null,null,5143]
[null,null,5144]
[null,null,5145]
[null,null,5146]
[null,null,5147]
[null,null,5148]
[null,null,5149]
[null,null,5150]
[null,null,5151]
[null,null,5152]
[null,null,5153]
[null,null,5154]
[null,null,5155]
[null,null,5156]
[null,null,5157]
[null,null,5158]
[null,null,5159]
[null,null,5160]
[null,null,5161]
[null,null,5162]
[null,null,5163]
[null,null,5164]
[null,null,5165]
[null,null,5166]
[null,null,5167]
[null,null,5168]
[null,null,5169]
[null,null,5170]
[null,null,5171]
[null,null,5172]
[null,null,5173]
[null,null,5174]
[null,null,5175]
[null,null,5176]
[null,null,5177]
[null,null,5178]
[null,null,5179]
[null,null,5180]
[null,null,5181]
[null,null,5182]
[null,null,5183]
[null,null,5184]
[null,null,5185]
[null,null,5186]
[null,null,5187]
[null,null,5188]
[null,null,5189]
[null,null,5190]
[null,null,5191]
[null,null,5192]
[null,null,5193]
[null,null,5194]
[null,null,5195]
[null,null,5196]
[null,null,5197]
[null,null,5198]
[null,null,5199]
[null,null,5200]
[null,null,5201]
[null,null,5202]
[null,null,5203]
[null,null,5204]
[null,null,5205]
[null,null,5206]
[null,null,5207]
[null,null,5208]
[null,null,5209]
[null,null,5210]
[null,null,5211]
[null,null,5212]
[null,null,5213]
[null,null,5214]
[null,null,5215]
[null,null,5216]
[null,null,5217]
[null,null,5218]
[null,null,5219]
[null,null,5220]
[null,null,5221]
[null,null,5222]
[null,null,5223]
[null,null,5224]
[null,null,5225]
[null,null,5226]
[null,null,5227]
[null,null,5228]
[null,null,5229]
[null,null,5230]
[null,null,5231]
[null,null,5232]
[null,null,5233]
[null,null,5234]
[null,null,5235]
[null,null,5236]
[null,null,5237]
[null,null,5238]
[null,null,5239]
[null,null,5240]
[null,null,5241]
[null,null,5242]
[null,null,5243]
[null,null,5244]
[null,null,5245]
[null,null,5246]
[null,null,5247]
[null,null,5248]
[null,null,5249]
[null,null,5250]
[null,null,5251]
[null,null,5252]
[null,null,5253]
[null,null,5254]
[null,null,5255]
[null,null,5256]
[null,null,5257]
[null,null,5258]
[null,null,5259]
[null,null,5260]
[null,null,5261]
[null,null,5262]
[null,null,5263]
[null,null,5264]
[null,null,5265]
[null,null,5266]
[null,null,5267]
[null,null,5268]
[null,null,5269]
[null,null,5270]
[null,null,5271]
[null,null,5272]
[null,null,5273]
[null,null,5274]
[null,null,5275]
[null,null,5276]
[null,null,5277]
[null,null,5278]
[null,null,5279]
[null,null,5280]
[null,null,5281]
[null,null,5282]
[null,null,5283]
[null,null,5284]
[null,null,5285]
[null,null,5286]
[null,null,5287]
[null,null,5288]
[null,null,5289]
[null,null,5290]
[null,null,5291]
[null,null,5292]
[null,null,5293]
[null,null,5294]
[null,null,5295]
[null,null,5296]
[null,null,5297]
[null,null,5298]
[null,null,5299]
[null,null,5300]
[null,null,5301]
[null,null,5302]
[null,null,5303]
[null,null,5304]
[null,null,5305]
[null,null,5306]
[null,null,5307]
[null,null,5308]
[null,null,5309]
[null,null,5310]
[null,null,5311]
[null,null,5312]
[null,null,5313]
[null,null,5314]
[null,null,5315]
[null,null,5316]
[null,null,5317]
[null,null,5318]
[null,null,5319]
[null,null,5320]
[null,null,5321]
[null,null,5322]
[null,null,5323]
[null,null,5324]
[null,null,5325]
[null,null,5326]
[null,null,5327]
[null,null,5328]
[null,null,5329]
[null,null,5330]
[null,null,5331]
[null,null,5332]
[null,null,5333]
[null,null,5334]
[null,null,5335]
[null,null,5336]
[null,null,5337]
[null,null,5338]
[null,null,5339]
[null,null,5340]
[null,null,5341]
[null,null,5342]
[null,null,5343]
[null,null,5344]
[null,null,5345]
[null,null,5346]
[null,null,5347]
[null,null,5348]
[null,null,5349]
[null,null,5350]
[null,null,5351]
[null,null,5352]
[null,null,5353]
[null,null,5354]
[null,null,5355]
[null,null,5356]
[null,null,5357]
[null,null,5358]
[null,null,5359]
[null,null,5360]
[null,null,5361]
[null,null,5362]
[null,null,5363]
[null,null,5364]
[null,null,5365]
[null,null,5366]
[null,null,5367]
[null,null,5368]
[null,null,5369]
[null,null,5370]
[null,null,5371]
[null,null,5372]
[null,null,5373]
[null,null,5374]
[null,null,5375]
[null,null,5376]
[null,null,5377]
[null,null,5378]
[null,null,5379]
[null,null,5380]
[null,null,5381]
[null,null,5382]
[null,null,5383]
[null,null,5384]
[null,null,5385]
[null,null,5386]
[null,null,5387]
[null,null,5388]
[null,null,5389]
[null,null,5390]
[null,null,5391]
[null,null,5392]
[null,null,5393]
[null,null,5394]
[null,null,5395]
[null,null,5396]
[null,null,5397]
[null,null,5398]
[null,null,5399]
[null,null,5400]
[null,null,5401]
[null,null,5402]
[null,null,5403]
[null,null,5404]
[null,null,5405]
[null,null,5406]
[null,null,5407]
[null,null,5408]
[null,null,5409]
[null,null,5410]
[null,null,5411]
[null,null,5412]
[null,null,5413]
[null,null,5414]
[null,null,5415]
[null,null,5416]
[null,null,5417]
[null,null,5418]
[null,null,5419]
[null,null,5420]
[null,null,5421]
[null,null,5422]
[null,null,5423]
[null,null,5424]
[null,null,5425]
[null,null,5426]
[null,null,5427]
[null,null,5428]
[null,null,5429]
[null,null,5430]
[null,null,5431]
[null,null,5432]
[null,null,5433]
[null,null,5434]
[null,null,5435]
[null,null,5436]
[null,null,5437]
[null,null,5438]
[null,null,5439]
[null,null,5440]
[null,null,5441]
[null,null,5442]
[null,null,5443]
[null,null,5444]
[null,null,5445]
[null,null,5446]
[null,null,5447]
[null,null,5448]
[null,null,5449]
[null,null,5450]
[null,null,5451]
[null,null,5452]
[null,null,5453]
[null,null,5454]
[null,null,5455]
[null,null,5456]
[null,null,5457]
[null,null,5458]
[null,null,5459]
[null,null,5460]
[null,null,5461]
[null,null,5462]
[null,null,5463]
[null,null,5464]
[null,null,5465]
[null,null,5466]
[null,null,5467]
[null,null,5468]
[null,null,5469]
[null,null,5470]
[null,null,5471]
[null,null,5472]
[null,null,5473]
[null,null,5474]
[null,null,5475]
[null,null,5476]
[null,null,5477]
[null,null,5478]
[null,null,5479]
[null,null,5480]
[null,null,5481]
[null,null,5482]
[null,null,5483]
[null,null,5484]
[null,null,5485]
[null,null,5486]
[null,null,5487]
[null,null,5488]
[null,null,5489]
[null,null,5490]
[null,null,5491]
[null,null,5492]
[null,null,5493]
[null,null,5494]
[null,null,5495]
[null,null,5496]
[null,null,5497]
[null,null,5498]
[null,null,5499]
[null,null,5500]
[null,null,5501]
[null,null,5502]
[null,null,5503]
[null,null,5504]
[null,null,5505]
[null,null,5506]
[null,null,5507]
[null,null,5508]
[null,null,5509]
[null,null,5510]
[null,null,5511]
[null,null,5512]
[null,null,5513]
[null,null,5514]
[null,null,5515]
[null,null,5516]
[null,null,5517]
[null,null,5518]
[null,null,5519]
[null,null,5520]
[null,null,5521]
[null,null,5522]
[null,null,5523]
[null,null,5524]
[null,null,5525]
[null,null,5526]
[null,null,5527]
[null,null,5528]
[null,null,5529]
[null,null,5530]
[null,null,5531]
[null,null,5532]
[null,null,5533]
[null,null,5534]
[null,null,5535]
[null,null,5536]
[null,null,5537]
[null,null,5538]
[null,null,5539]
[null,null,5540]
[null,null,5541]
[null,null,5542]
[null,null,5543]
[null,null,5544]
[null,null,5545]
[null,null,5546]
[null,null,5547]
[null,null,5548]
[null,null,5549]
[null,null,5550]
[null,null,5551]
[null,null,5552]
[null,null,5553]
[null,null,5554]
[null,null,5555]
[null,null,5556]
[null,null,5557]
[null,null,5558]
[null,null,5559]
[null,null,5560]
[null,null,5561]
[null,null,5562]
[null,null,5563]
[null,null,5564]
[null,null,5565]
[null,null,5566]
[null,null,5567]
[null,null,5568]
[null,null,5569]
[null,null,5570]
[null,null,5571]
[null,null,5572]
[null,null,5573]
[null,null,5574]
[null,null,5575]
[null,null,5576]
[null,null,5577]
[null,null,5578]
[null,null,5579]
[null,null,5580]
[null,null,5581]
[null,null,5582]
[null,null,5583]
[null,null,5584]
[null,null,5585]
[null,null,5586]
[null,null,5587]
[null,null,5588]
[null,null,5589]
[null,null,5590]
[null,null,5591]
[null,null,5592]
[null,null,5593]
[null,null,5594]
[null,null,5595]
[null,null,5596]
[null,null,5597]
[null,null,5598]
[null,null,5599]
[null,null,5600]
[null,null,5601]
[null,null,5602]
[null,null,5603]
[null,null,5604]
[null,null,5605]
[null,null,5606]
[null,null,5607]
[null,null,5608]
[null,null,5609]
[null,null,5610]
[null,null,5611]
[null,null,5612]
[null,null,5613]
[null,null,5614]
[null,null,5615]
[null,null,5616]
[null,null,5617]
[null,null,5618]
[null,null,5619]
[null,null,5620]
[null,null,5621]
[null,null,5622]
[null,null,5623]
[null,null,5624]
[null,null,5625]
[null,null,5626]
[null,null,5627]
[null,null,5628]
[null,null,5629]
[null,null,5630]
[null,null,5631]
[null,null,5632]
[null,null,5633]
[null,null,5634]
[null,null,5635]
[null,null,5636]
[null,null,5637]
[null,null,5638]
[null,null,5639]
[null,null,5640]
[null,null,5641]
[null,null,5642]
[null,null,5643]
[null,null,5644]
[null,null,5645]
[null,null,5646]
[null,null,5647]
[null,null,5648]
[null,null,5649]
[null,null,5650]
[null,null,5651]
[null,null,5652]
[null,null,5653]
[null,null,5654]
[null,null,5655]
[null,null,5656]
[null,null,5657]
[null,null,5658]
[null,null,5659]
[null,null,5660]
[null,null,5661]
[null,null,5662]
[null,null,5663]
[null,null,5664]
[null,null,5665]
[null,null,5666]
[null,null,5667]
[null,null,5668]
[null,null,5669]
[null,null,5670]
[null,null,5671]
[null,null,5672]
[null,null,5673]
[null,null,5674]
[null,null,5675]
[null,null,5676]
[null,null,5677]
[null,null,5678]
[null,null,5679]
[null,null,5680]
[null,null,5681]
[null,null,5682]
[null,null,5683]
[null,null,5684]
[null,null,5685]
[null,null,5686]
[null,null,5687]
[null,null,5688]
[null,null,5689]
[null,null,5690]
[null,null,5691]
[null,null,5692]
[null,null,5693]
[null,null,5694]
[null,null,5695]
[null,null,5696]
[null,null,5697]
[null,null,5698]
[null,null,5699]
[null,null,5700]
[null,null,5701]
[null,null,5702]
[null,null,5703]
[null,null,5704]
[null,null,5705]
[null,null,5706]
[null,null,5707]
[null,null,5708]
[null,null,5709]
[null,null,5710]
[null,null,5711]
[null,null,5712]
[null,null,5713]
[null,null,5714]
[null,null,5715]
[null,null,5716]
[null,null,5717]
[null,null,5718]
[null,null,5719]
[null,null,5720]
[null,null,5721]
[null,null,5722]
[null,null,5723]
[null,null,5724]
[null,null,5725]
[null,null,5726]
[null,null,5727]
[null,null,5728]
[null,null,5729]
[null,null,5730]
[null,null,5731]
[null,null,5732]
[null,null,5733]
[null,null,5734]
[null,null,5735]
[null,null,5736]
[null,null,5737]
[null,null,5738]
[null,null,5739]
[null,null,5740]
[null,null,5741]
[null,null,5742]
[null,null,5743]
[null,null,5744]
[null,null,5745]
[null,null,5746]
[null,null,5747]
[null,null,5748]
[null,null,5749]
[null,null,5750]
[null,null,5751]
[null,null,5752]
[null,null,5753]
[null,null,5754]
[null,null,5755]
[null,null,5756]
[null,null,5757]
[null,null,5758]
[null,null,5759]
[null,null,5760]
[null,null,5761]
[null,null,5762]
[null,null,5763]
[null,null,5764]
[null,null,5765]
[null,null,5766]
[null,null,5767]
[null,null,5768]
[null,null,5769]
[null,null,5770]
[null,null,5771]
[null,null,5772]
[null,null,5773]
[null,null,5774]
[null,null,5775]
[null,null,5776]
[null,null,5777]
[null,null,5778]
[null,null,5779]
[null,null,5780]
[null,null,5781]
[null,null,5782]
[null,null,5783]
[null,null,5784]
[null,null,5785]
[null,null,5786]
[null,null,5787]
[null,null,5788]
[null,null,5789]
[null,null,5790]
[null,null,5791]
[null,null,5792]
[null,null,5793]
[null,null,5794]
[null,null,5795]
[null,null,5796]
[null,null,5797]
[null,null,5798]
[null,null,5799]
[null,null,5800]
[null,null,5801]
[null,null,5802]
[null,null,5803]
[null,null,5804]
[null,null,5805]
[null,null,5806]
[null,null,5807]
[null,null,5808]
[null,null,5809]
[null,null,5810]
[null,null,5811]
[null,null,5812]
[null,null,5813]
[null,null,5814]
[null,null,5815]
[null,null,5816]
[null,null,5817]
[null,null,5818]
[null,null,5819]
[null,null,5820]
[null,null,5821]
[null,null,5822]
[null,null,5823]
[null,null,5824]
[null,null,5825]
[null,null,5826]
[null,null,5827]
[null,null,5828]
[null,null,5829]
[null,null,5830]
[null,null,5831]
[null,null,5832]
[null,null,5833]
[null,null,5834]
[null,null,5835]
[null,null,5836]
[null,null,5837]
[null,null,5838]
[null,null,5839]
[null,null,5840]
[null,null,5841]
[null,null,5842]
[null,null,5843]
[null,null,5844]
[null,null,5845]
[null,null,5846]
[null,null,5847]
[null,null,5848]
[null,null,5849]
[null,null,5850]
[null,null,5851]
[null,null,5852]
[null,null,5853]
[null,null,5854]
[null,null,5855]
[null,null,5856]
[null,null,5857]
[null,null,5858]
[null,null,5859]
[null,null,5860]
[null,null,5861]
[null,null,5862]
[null,null,5863]
[null,null,5864]
[null,null,5865]
[null,null,5866]
[null,null,5867]
[null,null,5868]
[null,null,5869]
[null,null,5870]
[null,null,5871]
[null,null,5872]
[null,null,5873]
[null,null,5874]
[null,null,5875]
[null,null,5876]
[null,null,5877]
[null,null,5878]
[null,null,5879]
[null,null,5880]
[null,null,5881]
[null,null,5882]
[null,null,5883]
[null,null,5884]
[null,null,5885]
[null,null,5886]
[null,null,5887]
[null,null,5888]
[null,null,5889]
[null,null,5890]
[null,null,5891]
[null,null,5892]
[null,null,5893]
[null,null,5894]
[null,null,5895]
[null,null,5896]
[null,null,5897]
[null,null,5898]
[null,null,5899]
[null,null,5900]
[null,null,5901]
[null,null,5902]
[null,null,5903]
[null,null,5904]
[null,null,5905]
[null,null,5906]
[null,null,5907]
[null,null,5908]
[null,null,5909]
[null,null,5910]
[null,null,5911]
[null,null,5912]
[null,null,5913]
[null,null,5914]
[null,null,5915]
[null,null,5916]
[null,null,5917]
[null,null,5918]
[null,null,5919]
[null,null,5920]
[null,null,5921]
[null,null,5922]
[null,null,5923]
[null,null,5924]
[null,null,5925]
[null,null,5926]
[null,null,5927]
[null,null,5928]
[null,null,5929]
[null,null,5930]
[null,null,5931]
[null,null,5932]
[null,null,5933]
[null,null,5934]
[null,null,5935]
[null,null,5936]
[null,null,5937]
[null,null,5938]
[null,null,5939]
[null,null,5940]
[null,null,5941]
[null,null,5942]
[null,null,5943]
[null,null,5944]
[null,null,5945]
[null,null,5946]
[null,null,5947]
[null,null,5948]
[null,null,5949]
[null,null,5950]
[null,null,5951]
[null,null,5952]
[null,null,5953]
[null,null,5954]
[null,null,5955]
[null,null,5956]
[null,null,5957]
[null,null,5958]
[null,null,5959]
[null,null,5960]
[null,null,5961]
[null,null,5962]
[null,null,5963]
[null,null,5964]
[null,null,5965]
[null,null,5966]
[null,null,5967]
[null,null,5968]
[null,null,5969]
[null,null,5970]
[null,null,5971]
[null,null,5972]
[null,null,5973]
[null,null,5974]
[null,null,5975]
[null,null,5976]
[null,null,5977]
[null,null,5978]
[null,null,5979]
[null,null,5980]
[null,null,5981]
[null,null,5982]
[null,null,5983]
[null,null,5984]
[null,null,5985]
[null,null,5986]
[null,null,5987]
[null,null,5988]
[null,null,5989]
[null,null,5990]
[null,null,5991]
[null,null,5992]
[null,null,5993]
[null,null,5994]
[null,null,5995]
[null,null,5996]
[null,null,5997]
[null,null,5998]
[null,null,5999]
[null,null,6000]
[null,null,6001]
[null,null,6002]
[null,null,6003]
[null,null,6004]
[null,null,6005]
[null,null,6006]
[null,null,6007]
[null,null,6008]
[null,null,6009]
[null,null,6010]
[null,null,6011]
[null,null,6012]
[null,null,6013]
[null,null,6014]
[null,null,6015]
[null,null,6016]
[null,null,6017]
[null,null,6018]
[null,null,6019]
[null,null,6020]
[null,null,6021]
[null,null,6022]
[null,null,6023]
[null,null,6024]
[null,null,6025]
[null,null,6026]
[null,null,6027]
[null,null,6028]
[null,null,6029]
[null,null,6030]
[null,null,6031]
[null,null,6032]
[null,null,6033]
[null,null,6034]
[null,null,6035]
[null,null,6036]
[null,null,6037]
[null,null,6038]
[null,null,6039]
[null,null,6040]
[null,null,6041]
[null,null,6042]
[null,null,6043]
[null,null,6044]
[null,null,6045]
[null,null,6046]
[null,null,6047]
[null,null,6048]
[null,null,6049]
[null,null,6050]
[null,null,6051]
[null,null,6052]
[null,null,6053]
[null,null,6054]
[null,null,6055]
[null,null,6056]
[null,null,6057]
[null,null,6058]
[null,null,6059]
[null,null,6060]
[null,null,6061]
[null,null,6062]
[null,null,6063]
[null,null,6064]
[null,null,6065]
[null,null,6066]
[null,null,6067]
[null,null,6068]
[null,null,6069]
[null,null,6070]
[null,null,6071]
[null,null,6072]
[null,null,6073]
[null,null,6074]
[null,null,6075]
[null,null,6076]
[null,null,6077]
[null,null,6078]
[null,null,6079]
[null,null,6080]
[null,null,6081]
[null,null,6082]
[null,null,6083]
[null,null,6084]
[null,null,6085]
[null,null,6086]
[null,null,6087]
[null,null,6088]
[null,null,6089]
[null,null,6090]
[null,null,6091]
[null,null,6092]
[null,null,6093]
[null,null,6094]
[null,null,6095]
[null,null,6096]
[null,null,6097]
[null,null,6098]
[null,null,6099]
[null,null,6100]
[null,null,6101]
[null,null,6102]
[null,null,6103]
[null,null,6104]
[null,null,6105]
[null,null,6106]
[null,null,6107]
[null,null,6108]
[null,null,6109]
[null,null,6110]
[null,null,6111]
[null,null,6112]
[null,null,6113]
[null,null,6114]
[null,null,6115]
[null,null,6116]
[null,null,6117]
[null,null,6118]
[null,null,6119]
[null,null,6120]
[null,null,6121]
[null,null,6122]
[null,null,6123]
[null,null,6124]
[null,null,6125]
[null,null,6126]
[null,null,6127]
[null,null,6128]
[null,null,6129]
[null,null,6130]
[null,null,6131]
[null,null,6132]
[null,null,6133]
[null,null,6134]
[null,null,6135]
[null,null,6136]
[null,null,6137]
[null,null,6138]
[null,null,6139]
[null,null,6140]
[null,null,6141]
[null,null,6142]
[null,null,6143]
[null,null,6144]
[null,null,6145]
[null,null,6146]
[null,null,6147]
[null,null,6148]
[null,null,6149]
[null,null,6150]
[null,null,6151]
[null,null,6152]
[null,null,6153]
[null,null,6154]
[null,null,6155]
[null,null,6156]
[null,null,6157]
[null,null,6158]
[null,null,6159]
[null,null,6160]
[null,null,6161]
[null,null,6162]
[null,null,6163]
[null,null,6164]
[null,null,6165]
[null,null,6166]
[null,null,6167]
[null,null,6168]
[null,null,6169]
[null,null,6170]
[null,null,6171]
[null,null,6172]
[null,null,6173]
[null,null,6174]
[null,null,6175]
[null,null,6176]
[null,null,6177]
[null,null,6178]
[null,null,6179]
[null,null,6180]
[null,null,6181]
[null,null,6182]
[null,null,6183]
[null,null,6184]
[null,null,6185]
[null,null,6186]
[null,null,6187]
[null,null,6188]
[null,null,6189]
[null,null,6190]
[null,null,6191]
[null,null,6192]
[null,null,6193]
[null,null,6194]
[null,null,6195]
[null,null,6196]
[null,null,6197]
[null,null,6198]
[null,null,6199]
[null,null,6200]
[null,null,6201]
[null,null,6202]
[null,null,6203]
[null,null,6204]
[null,null,6205]
[null,null,6206]
[null,null,6207]
[null,null,6208]
[null,null,6209]
[null,null,6210]
[null,null,6211]
[null,null,6212]
[null,null,6213]
[null,null,6214]
[null,null,6215]
[null,null,6216]
[null,null,6217]
[null,null,6218]
[null,null,6219]
[null,null,6220]
[null,null,6221]
[null,null,6222]
[null,null,6223]
[null,null,6224]
[null,null,6225]
[null,null,6226]
[null,null,6227]
[null,null,6228]
[null,null,6229]
[null,null,6230]
[null,null,6231]
[null,null,6232]
[null,null,6233]
[null,null,6234]
[null,null,6235]
[null,null,6236]
[null,null,6237]
[null,null,6238]
[null,null,6239]
[null,null,6240]
[null,null,6241]
[null,null,6242]
[null,null,6243]
[null,null,6244]
[null,null,6245]
[null,null,6246]
[null,null,6247]
[null,null,6248]
[null,null,6249]
[null,null,6250]
[null,null,6251]
[null,null,6252]
[null,null,6253]
[null,null,6254]
[null,null,6255]
[null,null,6256]
[null,null,6257]
[null,null,6258]
[null,null,6259]
[null,null,6260]
[null,null,6261]
[null,null,6262]
[null,null,6263]
[null,null,6264]
[null,null,6265]
[null,null,6266]
[null,null,6267]
[null,null,6268]
[null,null,6269]
[null,null,6270]
[null,null,6271]
[null,null,6272]
[null,null,6273]
[null,null,6274]
[null,null,6275]
[null,null,6276]
[null,null,6277]
[null,null,6278]
[null,null,6279]
[null,null,6280]
[null,null,6281]
[null,null,6282]
[null,null,6283]
[null,null,6284]
[null,null,6285]
[null,null,6286]
[null,null,6287]
[null,null,6288]
[null,null,6289]
[null,null,6290]
[null,null,6291]
[null,null,6292]
[null,null,6293]
[null,null,6294]
[null,null,6295]
[null,null,6296]
[null,null,6297]
[null,null,6298]
[null,null,6299]
[null,null,6300]
[null,null,6301]
[null,null,6302]
[null,null,6303]
[null,null,6304]
[null,null,6305]
[null,null,6306]
[null,null,6307]
[null,null,6308]
[null,null,6309]
[null,null,6310]
[null,null,6311]
[null,null,6312]
[null,null,6313]
[null,null,6314]
[null,null,6315]
[null,null,6316]
[null,null,6317]
[null,null,6318]
[null,null,6319]
[null,null,6320]
[null,null,6321]
[null,null,6322]
[null,null,6323]
[null,null,6324]
[null,null,6325]
[null,null,6326]
[null,null,6327]
[null,null,6328]
[null,null,6329]
[null,null,6330]
[null,null,6331]
[null,null,6332]
[null,null,6333]
[null,null,6334]
[null,null,6335]
[null,null,6336]
[null,null,6337]
[null,null,6338]
[null,null,6339]
[null,null,6340]
[null,null,6341]
[null,null,6342]
[null,null,6343]
[null,null,6344]
[null,null,6345]
[null,null,6346]
[null,null,6347]
[null,null,6348]
[null,null,6349]
[null,null,6350]
[null,null,6351]
[null,null,6352]
[null,null,6353]
[null,null,6354]
[null,null,6355]
[null,null,6356]
[null,null,6357]
[null,null,6358]
[null,null,6359]
[null,null,6360]
[null,null,6361]
[null,null,6362]
[null,null,6363]
[null,null,6364]
[null,null,6365]
[null,null,6366]
[null,null,6367]
[null,null,6368]
[null,null,6369]
[null,null,6370]
[null,null,6371]
[null,null,6372]
[null,null,6373]
[null,null,6374]
[null,null,6375]
[null,null,6376]
[null,null,6377]
[null,null,6378]
[null,null,6379]
[null,null,6380]
[null,null,6381]
[null,null,6382]
[null,null,6383]
[null,null,6384]
[null,null,6385]
[null,null,6386]
[null,null,6387]
[null,null,6388]
[null,null,6389]
[null,null,6390]
[null,null,6391]
[null,null,6392]
[null,null,6393]
[null,null,6394]
[null,null,6395]
[null,null,6396]
[null,null,6397]
[null,null,6398]
[null,null,6399]
[null,null,6400]
[null,null,6401]
[null,null,6402]
[null,null,6403]
[null,null,6404]
[null,null,6405]
[null,null,6406]
[null,null,6407]
[null,null,6408]
[null,null,6409]
[null,null,6410]
[null,null,6411]
[null,null,6412]
[null,null,6413]
[null,null,6414]
[null,null,6415]
[null,null,6416]
[null,null,6417]
[null,null,6418]
[null,null,6419]
[null,null,6420]
[null,null,6421]
[null,null,6422]
[null,null,6423]
[null,null,6424]
[null,null,6425]
[null,null,6426]
[null,null,6427]
[null,null,6428]
[null,null,6429]
[null,null,6430]
[null,null,6431]
[null,null,6432]
[null,null,6433]
[null,null,6434]
[null,null,6435]
[null,null,6436]
[null,null,6437]
[null,null,6438]
[null,null,6439]
[null,null,6440]
[null,null,6441]
[null,null,6442]
[null,null,6443]
[null,null,6444]
[null,null,6445]
[null,null,6446]
[null,null,6447]
[null,null,6448]
[null,null,6449]
[null,null,6450]
[null,null,6451]
[null,null,6452]
[null,null,6453]
[null,null,6454]
[null,null,6455]
[null,null,6456]
[null,null,6457]
[null,null,6458]
[null,null,6459]
[null,null,6460]
[null,null,6461]
[null,null,6462]
[null,null,6463]
[null,null,6464]
[null,null,6465]
[null,null,6466]
[null,null,6467]
[null,null,6468]
[null,null,6469]
[null,null,6470]
[null,null,6471]
[null,null,6472]
[null,null,6473]
[null,null,6474]
[null,null,6475]
[null,null,6476]
[null,null,6477]
[null,null,6478]
[null,null,6479]
[null,null,6480]
[null,null,6481]
[null,null,6482]
[null,null,6483]
[null,null,6484]
[null,null,6485]
[null,null,6486]
[null,null,6487]
[null,null,6488]
[null,null,6489]
[null,null,6490]
[null,null,6491]
[null,null,6492]
[null,null,6493]
[null,null,6494]
[null,null,6495]
[null,null,6496]
[null,null,6497]
[null,null,6498]
[null,null,6499]
[null,null,6500]
[null,null,6501]
[null,null,6502]
[null,null,6503]
[null,null,6504]
[null,null,6505]
[null,null,6506]
[null,null,6507]
[null,null,6508]
[null,null,6509]
[null,null,6510]
[null,null,6511]
[null,null,6512]
[null,null,6513]
[null,null,6514]
[null,null,6515]
[null,null,6516]
[null,null,6517]
[null,null,6518]
[null,null,6519]
[null,null,6520]
[null,null,6521]
[null,null,6522]
[null,null,6523]
[null,null,6524]
[null,null,6525]
[null,null,6526]
[null,null,6527]
[null,null,6528]
[null,null,6529]
[null,null,6530]
[null,null,6531]
[null,null,6532]
[null,null,6533]
[null,null,6534]
[null,null,6535]
[null,null,6536]
[null,null,6537]
[null,null,6538]
[null,null,6539]
[null,null,6540]
[null,null,6541]
[null,null,6542]
[null,null,6543]
[null,null,6544]
[null,null,6545]
[null,null,6546]
[null,null,6547]
[null,null,6548]
[null,null,6549]
[null,null,6550]
[null,null,6551]
[null,null,6552]
[null,null,6553]
[null,null,6554]
[null,null,6555]
[null,null,6556]
[null,null,6557]
[null,null,6558]
[null,null,6559]
[null,null,6560]
[null,null,6561]
[null,null,6562]
[null,null,6563]
[null,null,6564]
[null,null,6565]
[null,null,6566]
[null,null,6567]
[null,null,6568]
[null,null,6569]
[null,null,6570]
[null,null,6571]
[null,null,6572]
[null,null,6573]
[null,null,6574]
[null,null,6575]
[null,null,6576]
[null,null,6577]
[null,null,6578]
[null,null,6579]
[null,null,6580]
[null,null,6581]
[null,null,6582]
[null,null,6583]
[null,null,6584]
[null,null,6585]
[null,null,6586]
[null,null,6587]
[null,null,6588]
[null,null,6589]
[null,null,6590]
[null,null,6591]
[null,null,6592]
[null,null,6593]
[null,null,6594]
[null,null,6595]
[null,null,6596]
[null,null,6597]
[null,null,6598]
[null,null,6599]
[null,null,6600]
[null,null,6601]
[null,null,6602]
[null,null,6603]
[null,null,6604]
[null,null,6605]
[null,null,6606]
[null,null,6607]
[null,null,6608]
[null,null,6609]
[null,null,6610]
[null,null,6611]
[null,null,6612]
[null,null,6613]
[null,null,6614]
[null,null,6615]
[null,null,6616]
[null,null,6617]
[null,null,6618]
[null,null,6619]
[null,null,6620]
[null,null,6621]
[null,null,6622]
[null,null,6623]
[null,null,6624]
[null,null,6625]
[null,null,6626]
[null,null,6627]
[null,null,6628]
[null,null,6629]
[null,null,6630]
[null,null,6631]
[null,null,6632]
[null,null,6633]
[null,null,6634]
[null,null,6635]
[null,null,6636]
[null,null,6637]
[null,null,6638]
[null,null,6639]
[null,null,6640]
[null,null,6641]
[null,null,6642]
[null,null,6643]
[null,null,6644]
[null,null,6645]
[null,null,6646]
[null,null,6647]
[null,null,6648]
[null,null,6649]
[null,null,6650]
[null,null,6651]
[null,null,6652]
[null,null,6653]
[null,null,6654]
[null,null,6655]
[null,null,6656]
[null,null,6657]
[null,null,6658]
[null,null,6659]
[null,null,6660]
[null,null,6661]
[null,null,6662]
[null,null,6663]
[null,null,6664]
[null,null,6665]
[null,null,6666]
[null,null,6667]
[null,null,6668]
[null,null,6669]
[null,null,6670]
[null,null,6671]
[null,null,6672]
[null,null,6673]
[null,null,6674]
[null,null,6675]
[null,null,6676]
[null,null,6677]
[null,null,6678]
[null,null,6679]
[null,null,6680]
[null,null,6681]
[null,null,6682]
[null,null,6683]
[null,null,6684]
[null,null,6685]
[null,null,6686]
[null,null,6687]
[null,null,6688]
[null,null,6689]
[null,null,6690]
[null,null,6691]
[null,null,6692]
[null,null,6693]
[null,null,6694]
[null,null,6695]
[null,null,6696]
[null,null,6697]
[null,null,6698]
[null,null,6699]
[null,null,6700]
[null,null,6701]
[null,null,6702]
[null,null,6703]
[null,null,6704]
[null,null,6705]
[null,null,6706]
[null,null,6707]
[null,null,6708]
[null,null,6709]
[null,null,6710]
[null,null,6711]
[null,null,6712]
[null,null,6713]
[null,null,6714]
[null,null,6715]
[null,null,6716]
[null,null,6717]
[null,null,6718]
[null,null,6719]
[null,null,6720]
[null,null,6721]
[null,null,6722]
[null,null,6723]
[null,null,6724]
[null,null,6725]
[null,null,6726]
[null,null,6727]
[null,null,6728]
[null,null,6729]
[null,null,6730]
[null,null,6731]
[null,null,6732]
[null,null,6733]
[null,null,6734]
[null,null,6735]
[null,null,6736]
[null,null,6737]
[null,null,6738]
[null,null,6739]
[null,null,6740]
[null,null,6741]
[null,null,6742]
[null,null,6743]
[null,null,6744]
[null,null,6745]
[null,null,6746]
[null,null,6747]
[null,null,6748]
[null,null,6749]
[null,null,6750]
[null,null,6751]
[null,null,6752]
[null,null,6753]
[null,null,6754]
[null,null,6755]
[null,null,6756]
[null,null,6757]
[null,null,6758]
[null,null,6759]
[null,null,6760]
[null,null,6761]
[null,null,6762]
[null,null,6763]
[null,null,6764]
[null,null,6765]
[null,null,6766]
[null,null,6767]
[null,null,6768]
[null,null,6769]
[null,null,6770]
[null,null,6771]
[null,null,6772]
[null,null,6773]
[null,null,6774]
[null,null,6775]
[null,null,6776]
[null,null,6777]
[null,null,6778]
[null,null,6779]
[null,null,6780]
[null,null,6781]
[null,null,6782]
[null,null,6783]
[null,null,6784]
[null,null,6785]
[null,null,6786]
[null,null,6787]
[null,null,6788]
[null,null,6789]
[null,null,6790]
[null,null,6791]
[null,null,6792]
[null,null,6793]
[null,null,6794]
[null,null,6795]
[null,null,6796]
[null,null,6797]
[null,null,6798]
[null,null,6799]
[null,null,6800]
[null,null,6801]
[null,null,6802]
[null,null,6803]
[null,null,6804]
[null,null,6805]
[null,null,6806]
[null,null,6807]
[null,null,6808]
[null,null,6809]
[null,null,6810]
[null,null,6811]
[null,null,6812]
[null,null,6813]
[null,null,6814]
[null,null,6815]
[null,null,6816]
[null,null,6817]
[null,null,6818]
[null,null,6819]
[null,null,6820]
[null,null,6821]
[null,null,6822]
[null,null,6823]
[null,null,6824]
[null,null,6825]
[null,null,6826]
[null,null,6827]
[null,null,6828]
[null,null,6829]
[null,null,6830]
[null,null,6831]
[null,null,6832]
[null,null,6833]
[null,null,6834]
[null,null,6835]
[null,null,6836]
[null,null,6837]
[null,null,6838]
[null,null,6839]
[null,null,6840]
[null,null,6841]
[null,null,6842]
[null,null,6843]
[null,null,6844]
[null,null,6845]
[null,null,6846]
[null,null,6847]
[null,null,6848]
[null,null,6849]
[null,null,6850]
[null,null,6851]
[null,null,6852]
[null,null,6853]
[null,null,6854]
[null,null,6855]
[null,null,6856]
[null,null,6857]
[null,null,6858]
[null,null,6859]
[null,null,6860]
[null,null,6861]
[null,null,6862]
[null,null,6863]
[null,null,6864]
[null,null,6865]
[null,null,6866]
[null,null,6867]
[null,null,6868]
[null,null,6869]
[null,null,6870]
[null,null,6871]
[null,null,6872]
[null,null,6873]
[null,null,6874]
[null,null,6875]
[null,null,6876]
[null,null,6877]
[null,null,6878]
[null,null,6879]
[null,null,6880]
[null,null,6881]
[null,null,6882]
[null,null,6883]
[null,null,6884]
[null,null,6885]
[null,null,6886]
[null,null,6887]
[null,null,6888]
[null,null,6889]
[null,null,6890]
[null,null,6891]
[null,null,6892]
[null,null,6893]
[null,null,6894]
[null,null,6895]
[null,null,6896]
[null,null,6897]
[null,null,6898]
[null,null,6899]
[null,null,6900]
[null,null,6901]
[null,null,6902]
[null,null,6903]
[null,null,6904]
[null,null,6905]
[null,null,6906]
[null,null,6907]
[null,null,6908]
[null,null,6909]
[null,null,6910]
[null,null,6911]
[null,null,6912]
[null,null,6913]
[null,null,6914]
[null,null,6915]
[null,null,6916]
[null,null,6917]
[null,null,6918]
[null,null,6919]
[null,null,6920]
[null,null,6921]
[null,null,6922]
[null,null,6923]
[null,null,6924]
[null,null,6925]
[null,null,6926]
[null,null,6927]
[null,null,6928]
[null,null,6929]
[null,null,6930]
[null,null,6931]
[null,null,6932]
[null,null,6933]
[null,null,6934]
[null,null,6935]
[null,null,6936]
[null,null,6937]
[null,null,6938]
[null,null,6939]
[null,null,6940]
[null,null,6941]
[null,null,6942]
[null,null,6943]
[null,null,6944]
[null,null,6945]
[null,null,6946]
[null,null,6947]
[null,null,6948]
[null,null,6949]
[null,null,6950]
[null,null,6951]
[null,null,6952]
[null,null,6953]
[null,null,6954]
[null,null,6955]
[null,null,6956]
[null,null,6957]
[null,null,6958]
[null,null,6959]
[null,null,6960]
[null,null,6961]
[null,null,6962]
[null,null,6963]
[null,null,6964]
[null,null,6965]
[null,null,6966]
[null,null,6967]
[null,null,6968]
[null,null,6969]
[null,null,6970]
[null,null,6971]
[null,null,6972]
[null,null,6973]
[null,null,6974]
[null,null,6975]
[null,null,6976]
[null,null,6977]
[null,null,6978]
[null,null,6979]
[null,null,6980]
[null,null,6981]
[null,null,6982]
[null,null,6983]
[null,null,6984]
[null,null,6985]
[null,null,6986]
[null,null,6987]
[null,null,6988]
[null,null,6989]
[null,null,6990]
[null,null,6991]
[null,null,6992]
[null,null,6993]
[null,null,6994]
[null,null,6995]
[null,null,6996]
[null,null,6997]
[null,null,6998]
[null,null,6999]
[null,null,7000]
[null,null,7001]
[null,null,7002]
[null,null,7003]
[null,null,7004]
[null,null,7005]
[null,null,7006]
[null,null,7007]
[null,null,7008]
[null,null,7009]
[null,null,7010]
[null,null,7011]
[null,null,7012]
[null,null,7013]
[null,null,7014]
[null,null,7015]
[null,null,7016]
[null,null,7017]
[null,null,7018]
[null,null,7019]
[null,null,7020]
[null,null,7021]
[null,null,7022]
[null,null,7023]
[null,null,7024]
[null,null,7025]
[null,null,7026]
[null,null,7027]
[null,null,7028]
[null,null,7029]
[null,null,7030]
[null,null,7031]
[null,null,7032]
[null,null,7033]
[null,null,7034]
[null,null,7035]
[null,null,7036]
[null,null,7037]
[null,null,7038]
[null,null,7039]
[null,null,7040]
[null,null,7041]
[null,null,7042]
[null,null,7043]
[null,null,7044]
[null,null,7045]
[null,null,7046]
[null,null,7047]
[null,null,7048]
[null,null,7049]
[null,null,7050]
[null,null,7051]
[null,null,7052]
[null,null,7053]
[null,null,7054]
[null,null,7055]
[null,null,7056]
[null,null,7057]
[null,null,7058]
[null,null,7059]
[null,null,7060]
[null,null,7061]
[null,null,7062]
[null,null,7063]
[null,null,7064]
[null,null,7065]
[null,null,7066]
[null,null,7067]
[null,null,7068]
[null,null,7069]
[null,null,7070]
[null,null,7071]
[null,null,7072]
[null,null,7073]
[null,null,7074]
[null,null,7075]
[null,null,7076]
[null,null,7077]
[null,null,7078]
[null,null,7079]
[null,null,7080]
[null,null,7081]
[null,null,7082]
[null,null,7083]
[null,null,7084]
[null,null,7085]
[null,null,7086]
[null,null,7087]
[null,null,7088]
[null,null,7089]
[null,null,7090]
[null,null,7091]
[null,null,7092]
[null,null,7093]
[null,null,7094]
[null,null,7095]
[null,null,7096]
[null,null,7097]
[null,null,7098]
[null,null,7099]
[null,null,7100]
[null,null,7101]
[null,null,7102]
[null,null,7103]
[null,null,7104]
[null,null,7105]
[null,null,7106]
[null,null,7107]
[null,null,7108]
[null,null,7109]
[null,null,7110]
[null,null,7111]
[null,null,7112]
[null,null,7113]
[null,null,7114]
[null,null,7115]
[null,null,7116]
[null,null,7117]
[null,null,7118]
[null,null,7119]
[null,null,7120]
[null,null,7121]
[null,null,7122]
[null,null,7123]
[null,null,7124]
[null,null,7125]
[null,null,7126]
[null,null,7127]
[null,null,7128]
[null,null,7129]
[null,null,7130]
[null,null,7131]
[null,null,7132]
[null,null,7133]
[null,null,7134]
[null,null,7135]
[null,null,7136]
[null,null,7137]
[null,null,7138]
[null,null,7139]
[null,null,7140]
[null,null,7141]
[null,null,7142]
[null,null,7143]
[null,null,7144]
[null,null,7145]
[null,null,7146]
[null,null,7147]
[null,null,7148]
[null,null,7149]
[null,null,7150]
[null,null,7151]
[null,null,7152]
[null,null,7153]
[null,null,7154]
[null,null,7155]
[null,null,7156]
[null,null,7157]
[null,null,7158]
[null,null,7159]
[null,null,7160]
[null,null,7161]
[null,null,7162]
[null,null,7163]
[null,null,7164]
[null,null,7165]
[null,null,7166]
[null,null,7167]
[null,null,7168]
[null,null,7169]
[null,null,7170]
[null,null,7171]
[null,null,7172]
[null,null,7173]
[null,null,7174]
[null,null,7175]
[null,null,7176]
[null,null,7177]
[null,null,7178]
[null,null,7179]
[null,null,7180]
[null,null,7181]
[null,null,7182]
[null,null,7183]
[null,null,7184]
[null,null,7185]
[null,null,7186]
[null,null,7187]
[null,null,7188]
[null,null,7189]
[null,null,7190]
[null,null,7191]
[null,null,7192]
[null,null,7193]
[null,null,7194]
[null,null,7195]
[null,null,7196]
[null,null,7197]
[null,null,7198]
[null,null,7199]
[null,null,7200]
[null,null,7201]
[null,null,7202]
[null,null,7203]
[null,null,7204]
[null,null,7205]
[null,null,7206]
[null,null,7207]
[null,null,7208]
[null,null,7209]
[null,null,7210]
[null,null,7211]
[null,null,7212]
[null,null,7213]
[null,null,7214]
[null,null,7215]
[null,null,7216]
[null,null,7217]
[null,null,7218]
[null,null,7219]
[null,null,7220]
[null,null,7221]
[null,null,7222]
[null,null,7223]
[null,null,7224]
[null,null,7225]
[null,null,7226]
[null,null,7227]
[null,null,7228]
[null,null,7229]
[null,null,7230]
[null,null,7231]
[null,null,7232]
[null,null,7233]
[null,null,7234]
[null,null,7235]
[null,null,7236]
[null,null,7237]
[null,null,7238]
[null,null,7239]
[null,null,7240]
[null,null,7241]
[null,null,7242]
[null,null,7243]
[null,null,7244]
[null,null,7245]
[null,null,7246]
[null,null,7247]
[null,null,7248]
[null,null,7249]
[null,null,7250]
[null,null,7251]
[null,null,7252]
[null,null,7253]
[null,null,7254]
[null,null,7255]
[null,null,7256]
[null,null,7257]
[null,null,7258]
[null,null,7259]
[null,null,7260]
[null,null,7261]
[null,null,7262]
[null,null,7263]
[null,null,7264]
[null,null,7265]
[null,null,7266]
[null,null,7267]
[null,null,7268]
[null,null,7269]
[null,null,7270]
[null,null,7271]
[null,null,7272]
[null,null,7273]
[null,null,7274]
[null,null,7275]
[null,null,7276]
[null,null,7277]
[null,null,7278]
[null,null,7279]
[null,null,7280]
[null,null,7281]
[null,null,7282]
[null,null,7283]
[null,null,7284]
[null,null,7285]
[null,null,7286]
[null,null,7287]
[null,null,7288]
[null,null,7289]
[null,null,7290]
[null,null,7291]
[null,null,7292]
[null,null,7293]
[null,null,7294]
[null,null,7295]
[null,null,7296]
[null,null,7297]
[null,null,7298]
[null,null,7299]
[null,null,7300]
[null,null,7301]
[null,null,7302]
[null,null,7303]
[null,null,7304]
[null,null,7305]
[null,null,7306]
[null,null,7307]
[null,null,7308]
[null,null,7309]
[null,null,7310]
[null,null,7311]
[null,null,7312]
[null,null,7313]
[null,null,7314]
[null,null,7315]
[null,null,7316]
[null,null,7317]
[null,null,7318]
[null,null,7319]
[null,null,7320]
[null,null,7321]
[null,null,7322]
[null,null,7323]
[null,null,7324]
[null,null,7325]
[null,null,7326]
[null,null,7327]
[null,null,7328]
[null,null,7329]
[null,null,7330]
[null,null,7331]
[null,null,7332]
[null,null,7333]
[null,null,7334]
[null,null,7335]
[null,null,7336]
[null,null,7337]
[null,null,7338]
[null,null,7339]
[null,null,7340]
[null,null,7341]
[null,null,7342]
[null,null,7343]
[null,null,7344]
[null,null,7345]
[null,null,7346]
[null,null,7347]
[null,null,7348]
[null,null,7349]
[null,null,7350]
[null,null,7351]
[null,null,7352]
[null,null,7353]
[null,null,7354]
[null,null,7355]
[null,null,7356]
[null,null,7357]
[null,null,7358]
[null,null,7359]
[null,null,7360]
[null,null,7361]
[null,null,7362]
[null,null,7363]
[null,null,7364]
[null,null,7365]
[null,null,7366]
[null,null,7367]
[null,null,7368]
[null,null,7369]
[null,null,7370]
[null,null,7371]
[null,null,7372]
[null,null,7373]
[null,null,7374]
[null,null,7375]
[null,null,7376]
[null,null,7377]
[null,null,7378]
[null,null,7379]
[null,null,7380]
[null,null,7381]
[null,null,7382]
[null,null,7383]
[null,null,7384]
[null,null,7385]
[null,null,7386]
[null,null,7387]
[null,null,7388]
[null,null,7389]
[null,null,7390]
[null,null,7391]
[null,null,7392]
[null,null,7393]
[null,null,7394]
[null,null,7395]
[null,null,7396]
[null,null,7397]
[null,null,7398]
[null,null,7399]
[null,null,7400]
[null,null,7401]
[null,null,7402]
[null,null,7403]
[null,null,7404]
[null,null,7405]
[null,null,7406]
[null,null,7407]
[null,null,7408]
[null,null,7409]
[null,null,7410]
[null,null,7411]
[null,null,7412]
[null,null,7413]
[null,null,7414]
[null,null,7415]
[null,null,7416]
[null,null,7417]
[null,null,7418]
[null,null,7419]
[null,null,7420]
[null,null,7421]
[null,null,7422]
[null,null,7423]
[null,null,7424]
[null,null,7425]
[null,null,7426]
[null,null,7427]
[null,null,7428]
[null,null,7429]
[null,null,7430]
[null,null,7431]
[null,null,7432]
[null,null,7433]
[null,null,7434]
[null,null,7435]
[null,null,7436]
[null,null,7437]
[null,null,7438]
[null,null,7439]
[null,null,7440]
[null,null,7441]
[null,null,7442]
[null,null,7443]
[null,null,7444]
[null,null,7445]
[null,null,7446]
[null,null,7447]
[null,null,7448]
[null,null,7449]
[null,null,7450]
[null,null,7451]
[null,null,7452]
[null,null,7453]
[null,null,7454]
[null,null,7455]
[null,null,7456]
[null,null,7457]
[null,null,7458]
[null,null,7459]
[null,null,7460]
[null,null,7461]
[null,null,7462]
[null,null,7463]
[null,null,7464]
[null,null,7465]
[null,null,7466]
[null,null,7467]
[null,null,7468]
[null,null,7469]
[null,null,7470]
[null,null,7471]
[null,null,7472]
[null,null,7473]
[null,null,7474]
[null,null,7475]
[null,null,7476]
[null,null,7477]
[null,null,7478]
[null,null,7479]
[null,null,7480]
[null,null,7481]
[null,null,7482]
[null,null,7483]
[null,null,7484]
[null,null,7485]
[null,null,7486]
[null,null,7487]
[null,null,7488]
[null,null,7489]
[null,null,7490]
[null,null,7491]
[null,null,7492]
[null,null,7493]
[null,null,7494]
[null,null,7495]
[null,null,7496]
[null,null,7497]
[null,null,7498]
[null,null,7499]
[null,null,7500]
[null,null,7501]
[null,null,7502]
[null,null,7503]
[null,null,7504]
[null,null,7505]
[null,null,7506]
[null,null,7507]
[null,null,7508]
[null,null,7509]
[null,null,7510]
[null,null,7511]
[null,null,7512]
[null,null,7513]
[null,null,7514]
[null,null,7515]
[null,null,7516]
[null,null,7517]
[null,null,7518]
[null,null,7519]
[null,null,7520]
[null,null,7521]
[null,null,7522]
[null,null,7523]
[null,null,7524]
[null,null,7525]
[null,null,7526]
[null,null,7527]
[null,null,7528]
[null,null,7529]
[null,null,7530]
[null,null,7531]
[null,null,7532]
[null,null,7533]
[null,null,7534]
[null,null,7535]
[null,null,7536]
[null,null,7537]
[null,null,7538]
[null,null,7539]
[null,null,7540]
[null,null,7541]
[null,null,7542]
[null,null,7543]
[null,null,7544]
[null,null,7545]
[null,null,7546]
[null,null,7547]
[null,null,7548]
[null,null,7549]
[null,null,7550]
[null,null,7551]
[null,null,7552]
[null,null,7553]
[null,null,7554]
[null,null,7555]
[null,null,7556]
[null,null,7557]
[null,null,7558]
[null,null,7559]
[null,null,7560]
[null,null,7561]
[null,null,7562]
[null,null,7563]
[null,null,7564]
[null,null,7565]
[null,null,7566]
[null,null,7567]
[null,null,7568]
[null,null,7569]
[null,null,7570]
[null,null,7571]
[null,null,7572]
[null,null,7573]
[null,null,7574]
[null,null,7575]
[null,null,7576]
[null,null,7577]
[null,null,7578]
[null,null,7579]
[null,null,7580]
[null,null,7581]
[null,null,7582]
[null,null,7583]
[null,null,7584]
[null,null,7585]
[null,null,7586]
[null,null,7587]
[null,null,7588]
[null,null,7589]
[null,null,7590]
[null,null,7591]
[null,null,7592]
[null,null,7593]
[null,null,7594]
[null,null,7595]
[null,null,7596]
[null,null,7597]
[null,null,7598]
[null,null,7599]
[null,null,7600]
[null,null,7601]
[null,null,7602]
[null,null,7603]
[null,null,7604]
[null,null,7605]
[null,null,7606]
[null,null,7607]
[null,null,7608]
[null,null,7609]
[null,null,7610]
[null,null,7611]
[null,null,7612]
[null,null,7613]
[null,null,7614]
[null,null,7615]
[null,null,7616]
[null,null,7617]
[null,null,7618]
[null,null,7619]
[null,null,7620]
[null,null,7621]
[null,null,7622]
[null,null,7623]
[null,null,7624]
[null,null,7625]
[null,null,7626]
[null,null,7627]
[null,null,7628]
[null,null,7629]
[null,null,7630]
[null,null,7631]
[null,null,7632]
[null,null,7633]
[null,null,7634]
[null,null,7635]
[null,null,7636]
[null,null,7637]
[null,null,7638]
[null,null,7639]
[null,null,7640]
[null,null,7641]
[null,null,7642]
[null,null,7643]
[null,null,7644]
[null,null,7645]
[null,null,7646]
[null,null,7647]
[null,null,7648]
[null,null,7649]
[null,null,7650]
[null,null,7651]
[null,null,7652]
[null,null,7653]
[null,null,7654]
[null,null,7655]
[null,null,7656]
[null,null,7657]
[null,null,7658]
[null,null,7659]
[null,null,7660]
[null,null,7661]
[null,null,7662]
[null,null,7663]
[null,null,7664]
[null,null,7665]
[null,null,7666]
[null,null,7667]
[null,null,7668]
[null,null,7669]
[null,null,7670]
[null,null,7671]
[null,null,7672]
[null,null,7673]
[null,null,7674]
[null,null,7675]
[null,null,7676]
[null,null,7677]
[null,null,7678]
[null,null,7679]
[null,null,7680]
[null,null,7681]
[null,null,7682]
[null,null,7683]
[null,null,7684]
[null,null,7685]
[null,null,7686]
[null,null,7687]
[null,null,7688]
[null,null,7689]
[null,null,7690]
[null,null,7691]
[null,null,7692]
[null,null,7693]
[null,null,7694]
[null,null,7695]
[null,null,7696]
[null,null,7697]
[null,null,7698]
[null,null,7699]
[null,null,7700]
[null,null,7701]
[null,null,7702]
[null,null,7703]
[null,null,7704]
[null,null,7705]
[null,null,7706]
[null,null,7707]
[null,null,7708]
[null,null,7709]
[null,null,7710]
[null,null,7711]
[null,null,7712]
[null,null,7713]
[null,null,7714]
[null,null,7715]
[null,null,7716]
[null,null,7717]
[null,null,7718]
[null,null,7719]
[null,null,7720]
[null,null,7721]
[null,null,7722]
[null,null,7723]
[null,null,7724]
[null,null,7725]
[null,null,7726]
[null,null,7727]
[null,null,7728]
[null,null,7729]
[null,null,7730]
[null,null,7731]
[null,null,7732]
[null,null,7733]
[null,null,7734]
[null,null,7735]
[null,null,7736]
[null,null,7737]
[null,null,7738]
[null,null,7739]
[null,null,7740]
[null,null,7741]
[null,null,7742]
[null,null,7743]
[null,null,7744]
[null,null,7745]
[null,null,7746]
[null,null,7747]
[null,null,7748]
[null,null,7749]
[null,null,7750]
[null,null,7751]
[null,null,7752]
[null,null,7753]
[null,null,7754]
[null,null,7755]
[null,null,7756]
[null,null,7757]
[null,null,7758]
[null,null,7759]
[null,null,7760]
[null,null,7761]
[null,null,7762]
[null,null,7763]
[null,null,7764]
[null,null,7765]
[null,null,7766]
[null,null,7767]
[null,null,7768]
[null,null,7769]
[null,null,7770]
[null,null,7771]
[null,null,7772]
[null,null,7773]
[null,null,7774]
[null,null,7775]
[null,null,7776]
[null,null,7777]
[null,null,7778]
[null,null,7779]
[null,null,7780]
[null,null,7781]
[null,null,7782]
[null,null,7783]
[null,null,7784]
[null,null,7785]
[null,null,7786]
[null,null,7787]
[null,null,7788]
[null,null,7789]
[null,null,7790]
[null,null,7791]
[null,null,7792]
[null,null,7793]
[null,null,7794]
[null,null,7795]
[null,null,7796]
[null,null,7797]
[null,null,7798]
[null,null,7799]
[null,null,7800]
[null,null,7801]
[null,null,7802]
[null,null,7803]
[null,null,7804]
[null,null,7805]
[null,null,7806]
[null,null,7807]
[null,null,7808]
[null,null,7809]
[null,null,7810]
[null,null,7811]
[null,null,7812]
[null,null,7813]
[null,null,7814]
[null,null,7815]
[null,null,7816]
[null,null,7817]
[null,null,7818]
[null,null,7819]
[null,null,7820]
[null,null,7821]
[null,null,7822]
[null,null,7823]
[null,null,7824]
[null,null,7825]
[null,null,7826]
[null,null,7827]
[null,null,7828]
[null,null,7829]
[null,null,7830]
[null,null,7831]
[null,null,7832]
[null,null,7833]
[null,null,7834]
[null,null,7835]
[null,null,7836]
[null,null,7837]
[null,null,7838]
[null,null,7839]
[null,null,7840]
[null,null,7841]
[null,null,7842]
[null,null,7843]
[null,null,7844]
[null,null,7845]
[null,null,7846]
[null,null,7847]
[null,null,7848]
[null,null,7849]
[null,null,7850]
[null,null,7851]
[null,null,7852]
[null,null,7853]
[null,null,7854]
[null,null,7855]
[null,null,7856]
[null,null,7857]
[null,null,7858]
[null,null,7859]
[null,null,7860]
[null,null,7861]
[null,null,7862]
[null,null,7863]
[null,null,7864]
[null,null,7865]
[null,null,7866]
[null,null,7867]
[null,null,7868]
[null,null,7869]
[null,null,7870]
[null,null,7871]
[null,null,7872]
[null,null,7873]
[null,null,7874]
[null,null,7875]
[null,null,7876]
[null,null,7877]
[null,null,7878]
[null,null,7879]
[null,null,7880]
[null,null,7881]
[null,null,7882]
[null,null,7883]
[null,null,7884]
[null,null,7885]
[null,null,7886]
[null,null,7887]
[null,null,7888]
[null,null,7889]
[null,null,7890]
[null,null,7891]
[null,null,7892]
[null,null,7893]
[null,null,7894]
[null,null,7895]
[null,null,7896]
[null,null,7897]
[null,null,7898]
[null,null,7899]
[null,null,7900]
[null,null,7901]
[null,null,7902]
[null,null,7903]
[null,null,7904]
[null,null,7905]
[null,null,7906]
[null,null,7907]
[null,null,7908]
[null,null,7909]
[null,null,7910]
[null,null,7911]
[null,null,7912]
[null,null,7913]
[null,null,7914]
[null,null,7915]
[null,null,7916]
[null,null,7917]
[null,null,7918]
[null,null,7919]
[null,null,7920]
[null,null,7921]
[null,null,7922]
[null,null,7923]
[null,null,7924]
[null,null,7925]
[null,null,7926]
[null,null,7927]
[null,null,7928]
[null,null,7929]
[null,null,7930]
[null,null,7931]
[null,null,7932]
[null,null,7933]
[null,null,7934]
[null,null,7935]
[null,null,7936]
[null,null,7937]
[null,null,7938]
[null,null,7939]
[null,null,7940]
[null,null,7941]
[null,null,7942]
[null,null,7943]
[null,null,7944]
[null,null,7945]
[null,null,7946]
[null,null,7947]
[null,null,7948]
[null,null,7949]
[null,null,7950]
[null,null,7951]
[null,null,7952]
[null,null,7953]
[null,null,7954]
[null,null,7955]
[null,null,7956]
[null,null,7957]
[null,null,7958]
[null,null,7959]
[null,null,7960]
[null,null,7961]
[null,null,7962]
[null,null,7963]
[null,null,7964]
[null,null,7965]
[null,null,7966]
[null,null,7967]
[null,null,7968]
[null,null,7969]
[null,null,7970]
[null,null,7971]
[null,null,7972]
[null,null,7973]
[null,null,7974]
[null,null,7975]
[null,null,7976]
[null,null,7977]
[null,null,7978]
[null,null,7979]
[null,null,7980]
[null,null,7981]
[null,null,7982]
[null,null,7983]
[null,null,7984]
[null,null,7985]
[null,null,7986]
[null,null,7987]
[null,null,7988]
[null,null,7989]
[null,null,7990]
[null,null,7991]
[null,null,7992]
[null,null,7993]
[null,null,7994]
[null,null,7995]
[null,null,7996]
[null,null,7997]
[null,null,7998]
[null,null,7999]
[null,null,8000]
[null,null,8001]
[null,null,8002]
[null,null,8003]
[null,null,8004]
[null,null,8005]
[null,null,8006]
[null,null,8007]
[null,null,8008]
[null,null,8009]
[null,null,8010]
[null,null,8011]
[null,null,8012]
[null,null,8013]
[null,null,8014]
[null,null,8015]
[null,null,8016]
[null,null,8017]
[null,null,8018]
[null,null,8019]
[null,null,8020]
[null,null,8021]
[null,null,8022]
[null,null,8023]
[null,null,8024]
[null,null,8025]
[null,null,8026]
[null,null,8027]
[null,null,8028]
[null,null,8029]
[null,null,8030]
[null,null,8031]
[null,null,8032]
[null,null,8033]
[null,null,8034]
[null,null,8035]
[null,null,8036]
[null,null,8037]
[null,null,8038]
[null,null,8039]
[null,null,8040]
[null,null,8041]
[null,null,8042]
[null,null,8043]
[null,null,8044]
[null,null,8045]
[null,null,8046]
[null,null,8047]
[null,null,8048]
[null,null,8049]
[null,null,8050]
[null,null,8051]
[null,null,8052]
[null,null,8053]
[null,null,8054]
[null,null,8055]
[null,null,8056]
[null,null,8057]
[null,null,8058]
[null,null,8059]
[null,null,8060]
[null,null,8061]
[null,null,8062]
[null,null,8063]
[null,null,8064]
[null,null,8065]
[null,null,8066]
[null,null,8067]
[null,null,8068]
[null,null,8069]
[null,null,8070]
[null,null,8071]
[null,null,8072]
[null,null,8073]
[null,null,8074]
[null,null,8075]
[null,null,8076]
[null,null,8077]
[null,null,8078]
[null,null,8079]
[null,null,8080]
[null,null,8081]
[null,null,8082]
[null,null,8083]
[null,null,8084]
[null,null,8085]
[null,null,8086]
[null,null,8087]
[null,null,8088]
[null,null,8089]
[null,null,8090]
[null,null,8091]
[null,null,8092]
[null,null,8093]
[null,null,8094]
[null,null,8095]
[null,null,8096]
[null,null,8097]
[null,null,8098]
[null,null,8099]
[null,null,8100]
[null,null,8101]
[null,null,8102]
[null,null,8103]
[null,null,8104]
[null,null,8105]
[null,null,8106]
[null,null,8107]
[null,null,8108]
[null,null,8109]
[null,null,8110]
[null,null,8111]
[null,null,8112]
[null,null,8113]
[null,null,8114]
[null,null,8115]
[null,null,8116]
[null,null,8117]
[null,null,8118]
[null,null,8119]
[null,null,8120]
[null,null,8121]
[null,null,8122]
[null,null,8123]
[null,null,8124]
[null,null,8125]
[null,null,8126]
[null,null,8127]
[null,null,8128]
[null,null,8129]
[null,null,8130]
[null,null,8131]
[null,null,8132]
[null,null,8133]
[null,null,8134]
[null,null,8135]
[null,null,8136]
[null,null,8137]
[null,null,8138]
[null,null,8139]
[null,null,8140]
[null,null,8141]
[null,null,8142]
[null,null,8143]
[null,null,8144]
[null,null,8145]
[null,null,8146]
[null,null,8147]
[null,null,8148]
[null,null,8149]
[null,null,8150]
[null,null,8151]
[null,null,8152]
[null,null,8153]
[null,null,8154]
[null,null,8155]
[null,null,8156]
[null,null,8157]
[null,null,8158]
[null,null,8159]
[null,null,8160]
[null,null,8161]
[null,null,8162]
[null,null,8163]
[null,null,8164]
[null,null,8165]
[null,null,8166]
[null,null,8167]
[null,null,8168]
[null,null,8169]
[null,null,8170]
[null,null,8171]
[null,null,8172]
[null,null,8173]
[null,null,8174]
[null,null,8175]
[null,null,8176]
[null,null,8177]
[null,null,8178]
[null,null,8179]
[null,null,8180]
[null,null,8181]
[null,null,8182]
[null,null,8183]
[null,null,8184]
[null,null,8185]
[null,null,8186]
[null,null,8187]
[null,null,8188]
[null,null,8189]
[null,null,8190]
[null,null,8191]
[null,null,8192]
[null,null,8193]
[null,null,8194]
[null,null,8195]
[null,null,8196]
[null,null,8197]
[null,null,8198]
[null,null,8199]
[null,null,8200]
[null,null,8201]
[null,null,8202]
[null,null,8203]
[null,null,8204]
[null,null,8205]
[null,null,8206]
[null,null,8207]
[null,null,8208]
[null,null,8209]
[null,null,8210]
[null,null,8211]
[null,null,8212]
[null,null,8213]
[null,null,8214]
[null,null,8215]
[null,null,8216]
[null,null,8217]
[null,null,8218]
[null,null,8219]
[null,null,8220]
[null,null,8221]
[null,null,8222]
[null,null,8223]
[null,null,8224]
[null,null,8225]
[null,null,8226]
[null,null,8227]
[null,null,8228]
[null,null,8229]
[null,null,8230]
[null,null,8231]
[null,null,8232]
[null,null,8233]
[null,null,8234]
[null,null,8235]
[null,null,8236]
[null,null,8237]
[null,null,8238]
[null,null,8239]
[null,null,8240]
[null,null,8241]
[null,null,8242]
[null,null,8243]
[null,null,8244]
[null,null,8245]
[null,null,8246]
[null,null,8247]
[null,null,8248]
[null,null,8249]
[null,null,8250]
[null,null,8251]
[null,null,8252]
[null,null,8253]
[null,null,8254]
[null,null,8255]
[null,null,8256]
[null,null,8257]
[null,null,8258]
[null,null,8259]
[null,null,8260]
[null,null,8261]
[null,null,8262]
[null,null,8263]
[null,null,8264]
[null,null,8265]
[null,null,8266]
[null,null,8267]
[null,null,8268]
[null,null,8269]
[null,null,8270]
[null,null,8271]
[null,null,8272]
[null,null,8273]
[null,null,8274]
[null,null,8275]
[null,null,8276]
[null,null,8277]
[null,null,8278]
[null,null,8279]
[null,null,8280]
[null,null,8281]
[null,null,8282]
[null,null,8283]
[null,null,8284]
[null,null,8285]
[null,null,8286]
[null,null,8287]
[null,null,8288]
[null,null,8289]
[null,null,8290]
[null,null,8291]
[null,null,8292]
[null,null,8293]
[null,null,8294]
[null,null,8295]
[null,null,8296]
[null,null,8297]
[null,null,8298]
[null,null,8299]
[null,null,8300]
[null,null,8301]
[null,null,8302]
[null,null,8303]
[null,null,8304]
[null,null,8305]
[null,null,8306]
[null,null,8307]
[null,null,8308]
[null,null,8309]
[null,null,8310]
[null,null,8311]
[null,null,8312]
[null,null,8313]
[null,null,8314]
[null,null,8315]
[null,null,8316]
[null,null,8317]
[null,null,8318]
[null,null,8319]
[null,null,8320]
[null,null,8321]
[null,null,8322]
[null,null,8323]
[null,null,8324]
[null,null,8325]
[null,null,8326]
[null,null,8327]
[null,null,8328]
[null,null,8329]
[null,null,8330]
[null,null,8331]
[null,null,8332]
[null,null,8333]
[null,null,8334]
[null,null,8335]
[null,null,8336]
[null,null,8337]
[null,null,8338]
[null,null,8339]
[null,null,8340]
[null,null,8341]
[null,null,8342]
[null,null,8343]
[null,null,8344]
[null,null,8345]
[null,null,8346]
[null,null,8347]
[null,null,8348]
[null,null,8349]
[null,null,8350]
[null,null,8351]
[null,null,8352]
[null,null,8353]
[null,null,8354]
[null,null,8355]
[null,null,8356]
[null,null,8357]
[null,null,8358]
[null,null,8359]
[null,null,8360]
[null,null,8361]
[null,null,8362]
[null,null,8363]
[null,null,8364]
[null,null,8365]
[null,null,8366]
[null,null,8367]
[null,null,8368]
[null,null,8369]
[null,null,8370]
[null,null,8371]
[null,null,8372]
[null,null,8373]
[null,null,8374]
[null,null,8375]
[null,null,8376]
[null,null,8377]
[null,null,8378]
[null,null,8379]
[null,null,8380]
[null,null,8381]
[null,null,8382]
[null,null,8383]
[null,null,8384]
[null,null,8385]
[null,null,8386]
[null,null,8387]
[null,null,8388]
[null,null,8389]
[null,null,8390]
[null,null,8391]
[null,null,8392]
[null,null,8393]
[null,null,8394]
[null,null,8395]
[null,null,8396]
[null,null,8397]
[null,null,8398]
[null,null,8399]
[null,null,8400]
[null,null,8401]
[null,null,8402]
[null,null,8403]
[null,null,8404]
[null,null,8405]
[null,null,8406]
[null,null,8407]
[null,null,8408]
[null,null,8409]
[null,null,8410]
[null,null,8411]
[null,null,8412]
[null,null,8413]
[null,null,8414]
[null,null,8415]
[null,null,8416]
[null,null,8417]
[null,null,8418]
[null,null,8419]
[null,null,8420]
[null,null,8421]
[null,null,8422]
[null,null,8423]
[null,null,8424]
[null,null,8425]
[null,null,8426]
[null,null,8427]
[null,null,8428]
[null,null,8429]
[null,null,8430]
[null,null,8431]
[null,null,8432]
[null,null,8433]
[null,null,8434]
[null,null,8435]
[null,null,8436]
[null,null,8437]
[null,null,8438]
[null,null,8439]
[null,null,8440]
[null,null,8441]
[null,null,8442]
[null,null,8443]
[null,null,8444]
[null,null,8445]
[null,null,8446]
[null,null,8447]
[null,null,8448]
[null,null,8449]
[null,null,8450]
[null,null,8451]
[null,null,8452]
[null,null,8453]
[null,null,8454]
[null,null,8455]
[null,null,8456]
[null,null,8457]
[null,null,8458]
[null,null,8459]
[null,null,8460]
[null,null,8461]
[null,null,8462]
[null,null,8463]
[null,null,8464]
[null,null,8465]
[null,null,8466]
[null,null,8467]
[null,null,8468]
[null,null,8469]
[null,null,8470]
[null,null,8471]
[null,null,8472]
[null,null,8473]
[null,null,8474]
[null,null,8475]
[null,null,8476]
[null,null,8477]
[null,null,8478]
[null,null,8479]
[null,null,8480]
[null,null,8481]
[null,null,8482]
[null,null,8483]
[null,null,8484]
[null,null,8485]
[null,null,8486]
[null,null,8487]
[null,null,8488]
[null,null,8489]
[null,null,8490]
[null,null,8491]
[null,null,8492]
[null,null,8493]
[null,null,8494]
[null,null,8495]
[null,null,8496]
[null,null,8497]
[null,null,8498]
[null,null,8499]
[null,null,8500]
[null,null,8501]
[null,null,8502]
[null,null,8503]
[null,null,8504]
[null,null,8505]
[null,null,8506]
[null,null,8507]
[null,null,8508]
[null,null,8509]
[null,null,8510]
[null,null,8511]
[null,null,8512]
[null,null,8513]
[null,null,8514]
[null,null,8515]
[null,null,8516]
[null,null,8517]
[null,null,8518]
[null,null,8519]
[null,null,8520]
[null,null,8521]
[null,null,8522]
[null,null,8523]
[null,null,8524]
[null,null,8525]
[null,null,8526]
[null,null,8527]
[null,null,8528]
[null,null,8529]
[null,null,8530]
[null,null,8531]
[null,null,8532]
[null,null,8533]
[null,null,8534]
[null,null,8535]
[null,null,8536]
[null,null,8537]
[null,null,8538]
[null,null,8539]
[null,null,8540]
[null,null,8541]
[null,null,8542]
[null,null,8543]
[null,null,8544]
[null,null,8545]
[null,null,8546]
[null,null,8547]
[null,null,8548]
[null,null,8549]
[null,null,8550]
[null,null,8551]
[null,null,8552]
[null,null,8553]
[null,null,8554]
[null,null,8555]
[null,null,8556]
[null,null,8557]
[null,null,8558]
[null,null,8559]
[null,null,8560]
[null,null,8561]
[null,null,8562]
[null,null,8563]
[null,null,8564]
[null,null,8565]
[null,null,8566]
[null,null,8567]
[null,null,8568]
[null,null,8569]
[null,null,8570]
[null,null,8571]
[null,null,8572]
[null,null,8573]
[null,null,8574]
[null,null,8575]
[null,null,8576]
[null,null,8577]
[null,null,8578]
[null,null,8579]
[null,null,8580]
[null,null,8581]
[null,null,8582]
[null,null,8583]
[null,null,8584]
[null,null,8585]
[null,null,8586]
[null,null,8587]
[null,null,8588]
[null,null,8589]
[null,null,8590]
[null,null,8591]
[null,null,8592]
[null,null,8593]
[null,null,8594]
[null,null,8595]
[null,null,8596]
[null,null,8597]
[null,null,8598]
[null,null,8599]
[null,null,8600]
[null,null,8601]
[null,null,8602]
[null,null,8603]
[null,null,8604]
[null,null,8605]
[null,null,8606]
[null,null,8607]
[null,null,8608]
[null,null,8609]
[null,null,8610]
[null,null,8611]
[null,null,8612]
[null,null,8613]
[null,null,8614]
[null,null,8615]
[null,null,8616]
[null,null,8617]
[null,null,8618]
[null,null,8619]
[null,null,8620]
[null,null,8621]
[null,null,8622]
[null,null,8623]
[null,null,8624]
[null,null,8625]
[null,null,8626]
[null,null,8627]
[null,null,8628]
[null,null,8629]
[null,null,8630]
[null,null,8631]
[null,null,8632]
[null,null,8633]
[null,null,8634]
[null,null,8635]
[null,null,8636]
[null,null,8637]
[null,null,8638]
[null,null,8639]
[null,null,8640]
[null,null,8641]
[null,null,8642]
[null,null,8643]
[null,null,8644]
[null,null,8645]
[null,null,8646]
[null,null,8647]
[null,null,8648]
[null,null,8649]
[null,null,8650]
[null,null,8651]
[null,null,8652]
[null,null,8653]
[null,null,8654]
[null,null,8655]
[null,null,8656]
[null,null,8657]
[null,null,8658]
[null,null,8659]
[null,null,8660]
[null,null,8661]
[null,null,8662]
[null,null,8663]
[null,null,8664]
[null,null,8665]
[null,null,8666]
[null,null,8667]
[null,null,8668]
[null,null,8669]
[null,null,8670]
[null,null,8671]
[null,null,8672]
[null,null,8673]
[null,null,8674]
[null,null,8675]
[null,null,8676]
[null,null,8677]
[null,null,8678]
[null,null,8679]
[null,null,8680]
[null,null,8681]
[null,null,8682]
[null,null,8683]
[null,null,8684]
[null,null,8685]
[null,null,8686]
[null,null,8687]
[null,null,8688]
[null,null,8689]
[null,null,8690]
[null,null,8691]
[null,null,8692]
[null,null,8693]
[null,null,8694]
[null,null,8695]
[null,null,8696]
[null,null,8697]
[null,null,8698]
[null,null,8699]
[null,null,8700]
[null,null,8701]
[null,null,8702]
[null,null,8703]
[null,null,8704]
[null,null,8705]
[null,null,8706]
[null,null,8707]
[null,null,8708]
[null,null,8709]
[null,null,8710]
[null,null,8711]
[null,null,8712]
[null,null,8713]
[null,null,8714]
[null,null,8715]
[null,null,8716]
[null,null,8717]
[null,null,8718]
[null,null,8719]
[null,null,8720]
[null,null,8721]
[null,null,8722]
[null,null,8723]
[null,null,8724]
[null,null,8725]
[null,null,8726]
[null,null,8727]
[null,null,8728]
[null,null,8729]
[null,null,8730]
[null,null,8731]
[null,null,8732]
[null,null,8733]
[null,null,8734]
[null,null,8735]
[null,null,8736]
[null,null,8737]
[null,null,8738]
[null,null,8739]
[null,null,8740]
[null,null,8741]
[null,null,8742]
[null,null,8743]
[null,null,8744]
[null,null,8745]
[null,null,8746]
[null,null,8747]
[null,null,8748]
[null,null,8749]
[null,null,8750]
[null,null,8751]
[null,null,8752]
[null,null,8753]
[null,null,8754]
[null,null,8755]
[null,null,8756]
[null,null,8757]
[null,null,8758]
[null,null,8759]
[null,null,8760]
[null,null,8761]
[null,null,8762]
[null,null,8763]
[null,null,8764]
[null,null,8765]
[null,null,8766]
[null,null,8767]
[null,null,8768]
[null,null,8769]
[null,null,8770]
[null,null,8771]
[null,null,8772]
[null,null,8773]
[null,null,8774]
[null,null,8775]
[null,null,8776]
[null,null,8777]
[null,null,8778]
[null,null,8779]
[null,null,8780]
[null,null,8781]
[null,null,8782]
[null,null,8783]
[null,null,8784]
[null,null,8785]
[null,null,8786]
[null,null,8787]
[null,null,8788]
[null,null,8789]
[null,null,8790]
[null,null,8791]
[null,null,8792]
[null,null,8793]
[null,null,8794]
[null,null,8795]
[null,null,8796]
[null,null,8797]
[null,null,8798]
[null,null,8799]
[null,null,8800]
[null,null,8801]
[null,null,8802]
[null,null,8803]
[null,null,8804]
[null,null,8805]
[null,null,8806]
[null,null,8807]
[null,null,8808]
[null,null,8809]
[null,null,8810]
[null,null,8811]
[null,null,8812]
[null,null,8813]
[null,null,8814]
[null,null,8815]
[null,null,8816]
[null,null,8817]
[null,null,8818]
[null,null,8819]
[null,null,8820]
[null,null,8821]
[null,null,8822]
[null,null,8823]
[null,null,8824]
[null,null,8825]
[null,null,8826]
[null,null,8827]
[null,null,8828]
[null,null,8829]
[null,null,8830]
[null,null,8831]
[null,null,8832]
[null,null,8833]
[null,null,8834]
[null,null,8835]
[null,null,8836]
[null,null,8837]
[null,null,8838]
[null,null,8839]
[null,null,8840]
[null,null,8841]
[null,null,8842]
[null,null,8843]
[null,null,8844]
[null,null,8845]
[null,null,8846]
[null,null,8847]
[null,null,8848]
[null,null,8849]
[null,null,8850]
[null,null,8851]
[null,null,8852]
[null,null,8853]
[null,null,8854]
[null,null,8855]
[null,null,8856]
[null,null,8857]
[null,null,8858]
[null,null,8859]
[null,null,8860]
[null,null,8861]
[null,null,8862]
[null,null,8863]
[null,null,8864]
[null,null,8865]
[null,null,8866]
[null,null,8867]
[null,null,8868]
[null,null,8869]
[null,null,8870]
[null,null,8871]
[null,null,8872]
[null,null,8873]
[null,null,8874]
[null,null,8875]
[null,null,8876]
[null,null,8877]
[null,null,8878]
[null,null,8879]
[null,null,8880]
[null,null,8881]
[null,null,8882]
[null,null,8883]
[null,null,8884]
[null,null,8885]
[null,null,8886]
[null,null,8887]
[null,null,8888]
[null,null,8889]
[null,null,8890]
[null,null,8891]
[null,null,8892]
[null,null,8893]
[null,null,8894]
[null,null,8895]
[null,null,8896]
[null,null,8897]
[null,null,8898]
[null,null,8899]
[null,null,8900]
[null,null,8901]
[null,null,8902]
[null,null,8903]
[null,null,8904]
[null,null,8905]
[null,null,8906]
[null,null,8907]
[null,null,8908]
[null,null,8909]
[null,null,8910]
[null,null,8911]
[null,null,8912]
[null,null,8913]
[null,null,8914]
[null,null,8915]
[null,null,8916]
[null,null,8917]
[null,null,8918]
[null,null,8919]
[null,null,8920]
[null,null,8921]
[null,null,8922]
[null,null,8923]
[null,null,8924]
[null,null,8925]
[null,null,8926]
[null,null,8927]
[null,null,8928]
[null,null,8929]
[null,null,8930]
[null,null,8931]
[null,null,8932]
[null,null,8933]
[null,null,8934]
[null,null,8935]
[null,null,8936]
[null,null,8937]
[null,null,8938]
[null,null,8939]
[null,null,8940]
[null,null,8941]
[null,null,8942]
[null,null,8943]
[null,null,8944]
[null,null,8945]
[null,null,8946]
[null,null,8947]
[null,null,8948]
[null,null,8949]
[null,null,8950]
[null,null,8951]
[null,null,8952]
[null,null,8953]
[null,null,8954]
[null,null,8955]
[null,null,8956]
[null,null,8957]
[null,null,8958]
[null,null,8959]
[null,null,8960]
[null,null,8961]
[null,null,8962]
[null,null,8963]
[null,null,8964]
[null,null,8965]
[null,null,8966]
[null,null,8967]
[null,null,8968]
[null,null,8969]
[null,null,8970]
[null,null,8971]
[null,null,8972]
[null,null,8973]
[null,null,8974]
[null,null,8975]
[null,null,8976]
[null,null,8977]
[null,null,8978]
[null,null,8979]
[null,null,8980]
[null,null,8981]
[null,null,8982]
[null,null,8983]
[null,null,8984]
[null,null,8985]
[null,null,8986]
[null,null,8987]
[null,null,8988]
[null,null,8989]
[null,null,8990]
[null,null,8991]
[null,null,8992]
[null,null,8993]
[null,null,8994]
[null,null,8995]
[null,null,8996]
[null,null,8997]
[null,null,8998]
[null,null,8999]
[null,null,9000]
[null,null,9001]
[null,null,9002]
[null,null,9003]
[null,null,9004]
[null,null,9005]
[null,null,9006]
[null,null,9007]
[null,null,9008]
[null,null,9009]
[null,null,9010]
[null,null,9011]
[null,null,9012]
[null,null,9013]
[null,null,9014]
[null,null,9015]
[null,null,9016]
[null,null,9017]
[null,null,9018]
[null,null,9019]
[null,null,9020]
[null,null,9021]
[null,null,9022]
[null,null,9023]
[null,null,9024]
[null,null,9025]
[null,null,9026]
[null,null,9027]
[null,null,9028]
[null,null,9029]
[null,null,9030]
[null,null,9031]
[null,null,9032]
[null,null,9033]
[null,null,9034]
[null,null,9035]
[null,null,9036]
[null,null,9037]
[null,null,9038]
[null,null,9039]
[null,null,9040]
[null,null,9041]
[null,null,9042]
[null,null,9043]
[null,null,9044]
[null,null,9045]
[null,null,9046]
[null,null,9047]
[null,null,9048]
[null,null,9049]
[null,null,9050]
[null,null,9051]
[null,null,9052]
[null,null,9053]
[null,null,9054]
[null,null,9055]
[null,null,9056]
[null,null,9057]
[null,null,9058]
[null,null,9059]
[null,null,9060]
[null,null,9061]
[null,null,9062]
[null,null,9063]
[null,null,9064]
[null,null,9065]
[null,null,9066]
[null,null,9067]
[null,null,9068]
[null,null,9069]
[null,null,9070]
[null,null,9071]
[null,null,9072]
[null,null,9073]
[null,null,9074]
[null,null,9075]
[null,null,9076]
[null,null,9077]
[null,null,9078]
[null,null,9079]
[null,null,9080]
[null,null,9081]
[null,null,9082]
[null,null,9083]
[null,null,9084]
[null,null,9085]
[null,null,9086]
[null,null,9087]
[null,null,9088]
[null,null,9089]
[null,null,9090]
[null,null,9091]
[null,null,9092]
[null,null,9093]
[null,null,9094]
[null,null,9095]
[null,null,9096]
[null,null,9097]
[null,null,9098]
[null,null,9099]
[null,null,9100]
[null,null,9101]
[null,null,9102]
[null,null,9103]
[null,null,9104]
[null,null,9105]
[null,null,9106]
[null,null,9107]
[null,null,9108]
[null,null,9109]
[null,null,9110]
[null,null,9111]
[null,null,9112]
[null,null,9113]
[null,null,9114]
[null,null,9115]
[null,null,9116]
[null,null,9117]
[null,null,9118]
[null,null,9119]
[null,null,9120]
[null,null,9121]
[null,null,9122]
[null,null,9123]
[null,null,9124]
[null,null,9125]
[null,null,9126]
[null,null,9127]
[null,null,9128]
[null,null,9129]
[null,null,9130]
[null,null,9131]
[null,null,9132]
[null,null,9133]
[null,null,9134]
[null,null,9135]
[null,null,9136]
[null,null,9137]
[null,null,9138]
[null,null,9139]
[null,null,9140]
[null,null,9141]
[null,null,9142]
[null,null,9143]
[null,null,9144]
[null,null,9145]
[null,null,9146]
[null,null,9147]
[null,null,9148]
[null,null,9149]
[null,null,9150]
[null,null,9151]
[null,null,9152]
[null,null,9153]
[null,null,9154]
[null,null,9155]
[null,null,9156]
[null,null,9157]
[null,null,9158]
[null,null,9159]
[null,null,9160]
[null,null,9161]
[null,null,9162]
[null,null,9163]
[null,null,9164]
[null,null,9165]
[null,null,9166]
[null,null,9167]
[null,null,9168]
[null,null,9169]
[null,null,9170]
[null,null,9171]
[null,null,9172]
[null,null,9173]
[null,null,9174]
[null,null,9175]
[null,null,9176]
[null,null,9177]
[null,null,9178]
[null,null,9179]
[null,null,9180]
[null,null,9181]
[null,null,9182]
[null,null,9183]
[null,null,9184]
[null,null,9185]
[null,null,9186]
[null,null,9187]
[null,null,9188]
[null,null,9189]
[null,null,9190]
[null,null,9191]
[null,null,9192]
[null,null,9193]
[null,null,9194]
[null,null,9195]
[null,null,9196]
[null,null,9197]
[null,null,9198]
[null,null,9199]
[null,null,9200]
[null,null,9201]
[null,null,9202]
[null,null,9203]
[null,null,9204]
[null,null,9205]
[null,null,9206]
[null,null,9207]
[null,null,9208]
[null,null,9209]
[null,null,9210]
[null,null,9211]
[null,null,9212]
[null,null,9213]
[null,null,9214]
[null,null,9215]
[null,null,9216]
[null,null,9217]
[null,null,9218]
[null,null,9219]
[null,null,9220]
[null,null,9221]
[null,null,9222]
[null,null,9223]
[null,null,9224]
[null,null,9225]
[null,null,9226]
[null,null,9227]
[null,null,9228]
[null,null,9229]
[null,null,9230]
[null,null,9231]
[null,null,9232]
[null,null,9233]
[null,null,9234]
[null,null,9235]
[null,null,9236]
[null,null,9237]
[null,null,9238]
[null,null,9239]
[null,null,9240]
[null,null,9241]
[null,null,9242]
[null,null,9243]
[null,null,9244]
[null,null,9245]
[null,null,9246]
[null,null,9247]
[null,null,9248]
[null,null,9249]
[null,null,9250]
[null,null,9251]
[null,null,9252]
[null,null,9253]
[null,null,9254]
[null,null,9255]
[null,null,9256]
[null,null,9257]
[null,null,9258]
[null,null,9259]
[null,null,9260]
[null,null,9261]
[null,null,9262]
[null,null,9263]
[null,null,9264]
[null,null,9265]
[null,null,9266]
[null,null,9267]
[null,null,9268]
[null,null,9269]
[null,null,9270]
[null,null,9271]
[null,null,9272]
[null,null,9273]
[null,null,9274]
[null,null,9275]
[null,null,9276]
[null,null,9277]
[null,null,9278]
[null,null,9279]
[null,null,9280]
[null,null,9281]
[null,null,9282]
[null,null,9283]
[null,null,9284]
[null,null,9285]
[null,null,9286]
[null,null,9287]
[null,null,9288]
[null,null,9289]
[null,null,9290]
[null,null,9291]
[null,null,9292]
[null,null,9293]
[null,null,9294]
[null,null,9295]
[null,null,9296]
[null,null,9297]
[null,null,9298]
[null,null,9299]
[null,null,9300]
[null,null,9301]
[null,null,9302]
[null,null,9303]
[null,null,9304]
[null,null,9305]
[null,null,9306]
[null,null,9307]
[null,null,9308]
[null,null,9309]
[null,null,9310]
[null,null,9311]
[null,null,9312]
[null,null,9313]
[null,null,9314]
[null,null,9315]
[null,null,9316]
[null,null,9317]
[null,null,9318]
[null,null,9319]
[null,null,9320]
[null,null,9321]
[null,null,9322]
[null,null,9323]
[null,null,9324]
[null,null,9325]
[null,null,9326]
[null,null,9327]
[null,null,9328]
[null,null,9329]
[null,null,9330]
[null,null,9331]
[null,null,9332]
[null,null,9333]
[null,null,9334]
[null,null,9335]
[null,null,9336]
[null,null,9337]
[null,null,9338]
[null,null,9339]
[null,null,9340]
[null,null,9341]
[null,null,9342]
[null,null,9343]
[null,null,9344]
[null,null,9345]
[null,null,9346]
[null,null,9347]
[null,null,9348]
[null,null,9349]
[null,null,9350]
[null,null,9351]
[null,null,9352]
[null,null,9353]
[null,null,9354]
[null,null,9355]
[null,null,9356]
[null,null,9357]
[null,null,9358]
[null,null,9359]
[null,null,9360]
[null,null,9361]
[null,null,9362]
[null,null,9363]
[null,null,9364]
[null,null,9365]
[null,null,9366]
[null,null,9367]
[null,null,9368]
[null,null,9369]
[null,null,9370]
[null,null,9371]
[null,null,9372]
[null,null,9373]
[null,null,9374]
[null,null,9375]
[null,null,9376]
[null,null,9377]
[null,null,9378]
[null,null,9379]
[null,null,9380]
[null,null,9381]
[null,null,9382]
[null,null,9383]
[null,null,9384]
[null,null,9385]
[null,null,9386]
[null,null,9387]
[null,null,9388]
[null,null,9389]
[null,null,9390]
[null,null,9391]
[null,null,9392]
[null,null,9393]
[null,null,9394]
[null,null,9395]
[null,null,9396]
[null,null,9397]
[null,null,9398]
[null,null,9399]
[null,null,9400]
[null,null,9401]
[null,null,9402]
[null,null,9403]
[null,null,9404]
[null,null,9405]
[null,null,9406]
[null,null,9407]
[null,null,9408]
[null,null,9409]
[null,null,9410]
[null,null,9411]
[null,null,9412]
[null,null,9413]
[null,null,9414]
[null,null,9415]
[null,null,9416]
[null,null,9417]
[null,null,9418]
[null,null,9419]
[null,null,9420]
[null,null,9421]
[null,null,9422]
[null,null,9423]
[null,null,9424]
[null,null,9425]
[null,null,9426]
[null,null,9427]
[null,null,9428]
[null,null,9429]
[null,null,9430]
[null,null,9431]
[null,null,9432]
[null,null,9433]
[null,null,9434]
[null,null,9435]
[null,null,9436]
[null,null,9437]
[null,null,9438]
[null,null,9439]
[null,null,9440]
[null,null,9441]
[null,null,9442]
[null,null,9443]
[null,null,9444]
[null,null,9445]
[null,null,9446]
[null,null,9447]
[null,null,9448]
[null,null,9449]
[null,null,9450]
[null,null,9451]
[null,null,9452]
[null,null,9453]
[null,null,9454]
[null,null,9455]
[null,null,9456]
[null,null,9457]
[null,null,9458]
[null,null,9459]
[null,null,9460]
[null,null,9461]
[null,null,9462]
[null,null,9463]
[null,null,9464]
[null,null,9465]
[null,null,9466]
[null,null,9467]
[null,null,9468]
[null,null,9469]
[null,null,9470]
[null,null,9471]
[null,null,9472]
[null,null,9473]
[null,null,9474]
[null,null,9475]
[null,null,9476]
[null,null,9477]
[null,null,9478]
[null,null,9479]
[null,null,9480]
[null,null,9481]
[null,null,9482]
[null,null,9483]
[null,null,9484]
[null,null,9485]
[null,null,9486]
[null,null,9487]
[null,null,9488]
[null,null,9489]
[null,null,9490]
[null,null,9491]
[null,null,9492]
[null,null,9493]
[null,null,9494]
[null,null,9495]
[null,null,9496]
[null,null,9497]
[null,null,9498]
[null,null,9499]
[null,null,9500]
[null,null,9501]
[null,null,9502]
[null,null,9503]
[null,null,9504]
[null,null,9505]
[null,null,9506]
[null,null,9507]
[null,null,9508]
[null,null,9509]
[null,null,9510]
[null,null,9511]
[null,null,9512]
[null,null,9513]
[null,null,9514]
[null,null,9515]
[null,null,9516]
[null,null,9517]
[null,null,9518]
[null,null,9519]
[null,null,9520]
[null,null,9521]
[null,null,9522]
[null,null,9523]
[null,null,9524]
[null,null,9525]
[null,null,9526]
[null,null,9527]
[null,null,9528]
[null,null,9529]
[null,null,9530]
[null,null,9531]
[null,null,9532]
[null,null,9533]
[null,null,9534]
[null,null,9535]
[null,null,9536]
[null,null,9537]
[null,null,9538]
[null,null,9539]
[null,null,9540]
[null,null,9541]
[null,null,9542]
[null,null,9543]
[null,null,9544]
[null,null,9545]
[null,null,9546]
[null,null,9547]
[null,null,9548]
[null,null,9549]
[null,null,9550]
[null,null,9551]
[null,null,9552]
[null,null,9553]
[null,null,9554]
[null,null,9555]
[null,null,9556]
[null,null,9557]
[null,null,9558]
[null,null,9559]
[null,null,9560]
[null,null,9561]
[null,null,9562]
[null,null,9563]
[null,null,9564]
[null,null,9565]
[null,null,9566]
[null,null,9567]
[null,null,9568]
[null,null,9569]
[null,null,9570]
[null,null,9571]
[null,null,9572]
[null,null,9573]
[null,null,9574]
[null,null,9575]
[null,null,9576]
[null,null,9577]
[null,null,9578]
[null,null,9579]
[null,null,9580]
[null,null,9581]
[null,null,9582]
[null,null,9583]
[null,null,9584]
[null,null,9585]
[null,null,9586]
[null,null,9587]
[null,null,9588]
[null,null,9589]
[null,null,9590]
[null,null,9591]
[null,null,9592]
[null,null,9593]
[null,null,9594]
[null,null,9595]
[null,null,9596]
[null,null,9597]
[null,null,9598]
[null,null,9599]
[null,null,9600]
[null,null,9601]
[null,null,9602]
[null,null,9603]
[null,null,9604]
[null,null,9605]
[null,null,9606]
[null,null,9607]
[null,null,9608]
[null,null,9609]
[null,null,9610]
[null,null,9611]
[null,null,9612]
[null,null,9613]
[null,null,9614]
[null,null,9615]
[null,null,9616]
[null,null,9617]
[null,null,9618]
[null,null,9619]
[null,null,9620]
[null,null,9621]
[null,null,9622]
[null,null,9623]
[null,null,9624]
[null,null,9625]
[null,null,9626]
[null,null,9627]
[null,null,9628]
[null,null,9629]
[null,null,9630]
[null,null,9631]
[null,null,9632]
[null,null,9633]
[null,null,9634]
[null,null,9635]
[null,null,9636]
[null,null,9637]
[null,null,9638]
[null,null,9639]
[null,null,9640]
[null,null,9641]
[null,null,9642]
[null,null,9643]
[null,null,9644]
[null,null,9645]
[null,null,9646]
[null,null,9647]
[null,null,9648]
[null,null,9649]
[null,null,9650]
[null,null,9651]
[null,null,9652]
[null,null,9653]
[null,null,9654]
[null,null,9655]
[null,null,9656]
[null,null,9657]
[null,null,9658]
[null,null,9659]
[null,null,9660]
[null,null,9661]
[null,null,9662]
[null,null,9663]
[null,null,9664]
[null,null,9665]
[null,null,9666]
[null,null,9667]
[null,null,9668]
[null,null,9669]
[null,null,9670]
[null,null,9671]
[null,null,9672]
[null,null,9673]
[null,null,9674]
[null,null,9675]
[null,null,9676]
[null,null,9677]
[null,null,9678]
[null,null,9679]
[null,null,9680]
[null,null,9681]
[null,null,9682]
[null,null,9683]
[null,null,9684]
[null,null,9685]
[null,null,9686]
[null,null,9687]
[null,null,9688]
[null,null,9689]
[null,null,9690]
[null,null,9691]
[null,null,9692]
[null,null,9693]
[null,null,9694]
[null,null,9695]
[null,null,9696]
[null,null,9697]
[null,null,9698]
[null,null,9699]
[null,null,9700]
[null,null,9701]
[null,null,9702]
[null,null,9703]
[null,null,9704]
[null,null,9705]
[null,null,9706]
[null,null,9707]
[null,null,9708]
[null,null,9709]
[null,null,9710]
[null,null,9711]
[null,null,9712]
[null,null,9713]
[null,null,9714]
[null,null,9715]
[null,null,9716]
[null,null,9717]
[null,null,9718]
[null,null,9719]
[null,null,9720]
[null,null,9721]
[null,null,9722]
[null,null,9723]
[null,null,9724]
[null,null,9725]
[null,null,9726]
[null,null,9727]
[null,null,9728]
[null,null,9729]
[null,null,9730]
[null,null,9731]
[null,null,9732]
[null,null,9733]
[null,null,9734]
[null,null,9735]
[null,null,9736]
[null,null,9737]
[null,null,9738]
[null,null,9739]
[null,null,9740]
[null,null,9741]
[null,null,9742]
[null,null,9743]
[null,null,9744]
[null,null,9745]
[null,null,9746]
[null,null,9747]
[null,null,9748]
[null,null,9749]
[null,null,9750]
[null,null,9751]
[null,null,9752]
[null,null,9753]
[null,null,9754]
[null,null,9755]
[null,null,9756]
[null,null,9757]
[null,null,9758]
[null,null,9759]
[null,null,9760]
[null,null,9761]
[null,null,9762]
[null,null,9763]
[null,null,9764]
[null,null,9765]
[null,null,9766]
[null,null,9767]
[null,null,9768]
[null,null,9769]
[null,null,9770]
[null,null,9771]
[null,null,9772]
[null,null,9773]
[null,null,9774]
[null,null,9775]
[null,null,9776]
[null,null,9777]
[null,null,9778]
[null,null,9779]
[null,null,9780]
[null,null,9781]
[null,null,9782]
[null,null,9783]
[null,null,9784]
[null,null,9785]
[null,null,9786]
[null,null,9787]
[null,null,9788]
[null,null,9789]
[null,null,9790]
[null,null,9791]
[null,null,9792]
[null,null,9793]
[null,null,9794]
[null,null,9795]
[null,null,9796]
[null,null,9797]
[null,null,9798]
[null,null,9799]
[null,null,9800]
[null,null,9801]
[null,null,9802]
[null,null,9803]
[null,null,9804]
[null,null,9805]
[null,null,9806]
[null,null,9807]
[null,null,9808]
[null,null,9809]
[null,null,9810]
[null,null,9811]
[null,null,9812]
[null,null,9813]
[null,null,9814]
[null,null,9815]
[null,null,9816]
[null,null,9817]
[null,null,9818]
[null,null,9819]
[null,null,9820]
[null,null,9821]
[null,null,9822]
[null,null,9823]
[null,null,9824]
[null,null,9825]
[null,null,9826]
[null,null,9827]
[null,null,9828]
[null,null,9829]
[null,null,9830]
[null,null,9831]
[null,null,9832]
[null,null,9833]
[null,null,9834]
[null,null,9835]
[null,null,9836]
[null,null,9837]
[null,null,9838]
[null,null,9839]
[null,null,9840]
[null,null,9841]
[null,null,9842]
[null,null,9843]
[null,null,9844]
[null,null,9845]
[null,null,9846]
[null,null,9847]
[null,null,9848]
[null,null,9849]
[null,null,9850]
[null,null,9851]
[null,null,9852]
[null,null,9853]
[null,null,9854]
[null,null,9855]
[null,null,9856]
[null,null,9857]
[null,null,9858]
[null,null,9859]
[null,null,9860]
[null,null,9861]
[null,null,9862]
[null,null,9863]
[null,null,9864]
[null,null,9865]
[null,null,9866]
[null,null,9867]
[null,null,9868]
[null,null,9869]
[null,null,9870]
[null,null,9871]
[null,null,9872]
[null,null,9873]
[null,null,9874]
[null,null,9875]
[null,null,9876]
[null,null,9877]
[null,null,9878]
[null,null,9879]
[null,null,9880]
[null,null,9881]
[null,null,9882]
[null,null,9883]
[null,null,9884]
[null,null,9885]
[null,null,9886]
[null,null,9887]
[null,null,9888]
[null,null,9889]
[null,null,9890]
[null,null,9891]
[null,null,9892]
[null,null,9893]
[null,null,9894]
[null,null,9895]
[null,null,9896]
[null,null,9897]
[null,null,9898]
[null,null,9899]
[null,null,9900]
[null,null,9901]
[null,null,9902]
[null,null,9903]
[null,null,9904]
[null,null,9905]
[null,null,9906]
[null,null,9907]
[null,null,9908]
[null,null,9909]
[null,null,9910]
[null,null,9911]
[null,null,9912]
[null,null,9913]
[null,null,9914]
[null,null,9915]
[null,null,9916]
[null,null,9917]
[null,null,9918]
[null,null,9919]
[null,null,9920]
[null,null,9921]
[null,null,9922]
[null,null,9923]
[null,null,9924]
[null,null,9925]
[null,null,9926]
[null,null,9927]
[null,null,9928]
[null,null,9929]
[null,null,9930]
[null,null,9931]
[null,null,9932]
[null,null,9933]
[null,null,9934]
[null,null,9935]
[null,null,9936]
[null,null,9937]
[null,null,9938]
[null,null,9939]
[null,null,9940]
[null,null,9941]
[null,null,9942]
[null,null,9943]
[null,null,9944]
[null,null,9945]
[null,null,9946]
[null,null,9947]
[null,null,9948]
[null,null,9949]
[null,null,9950]
[null,null,9951]
[null,null,9952]
[null,null,9953]
[null,null,9954]
[null,null,9955]
[null,null,9956]
[null,null,9957]
[null,null,9958]
[null,null,9959]
[null,null,9960]
[null,null,9961]
[null,null,9962]
[null,null,9963]
[null,null,9964]
[null,null,9965]
[null,null,9966]
[null,null,9967]
[null,null,9968]
[null,null,9969]
[null,null,9970]
[null,null,9971]
[null,null,9972]
[null,null,9973]
[null,null,9974]
[null,null,9975]
[null,null,9976]
[null,null,9977]
[null,null,9978]
[null,null,9979]
[null,null,9980]
[null,null,9981]
[null,null,9982]
[null,null,9983]
[null,null,9984]
[null,null,9985]
[null,null,9986]
[null,null,9987]
[null,null,9988]
[null,null,9989]
[null,null,9990]
[null,null,9991]
[null,null,9992]
[null,null,9993]
[null,null,9994]
[null,null,9995]
[null,null,9996]
[null,null,9997]
[null,null,9998]
[null,null,9999]
[null,null,10000]
[null,null,10001]
[null,null,10002]
[null,null,10003]
[null,null,10004]
[null,null,10005]
[null,null,10006]
[null,null,10007]
[null,null,10008]
[null,null,10009]
[null,null,10010]
[null,null,10011]
[null,null,10012]
[null,null,10013]
[null,null,10014]
[null,null,10015]
[null,null,10016]
[null,null,10017]
[null,null,10018]
[null,null,10019]
[null,null,10020]
[null,null,10021]
[null,null,10022]
[null,null,10023]
[null,null,10024]
[null,null,10025]
[null,null,10026]
[null,null,10027]
[null,null,10028]
[null,null,10029]
[null,null,10030]
[null,null,10031]
[null,null,10032]
[null,null,10033]
[null,null,10034]
[null,null,10035]
[null,null,10036]
[null,null,10037]
[null,null,10038]
[null,null,10039]
[null,null,10040]
[null,null,10041]
[null,null,10042]
[null,null,10043]
[null,null,10044]
[null,null,10045]
[null,null,10046]
[null,null,10047]
[null,null,10048]
[null,null,10049]
[null,null,10050]
[null,null,10051]
[null,null,10052]
[null,null,10053]
[null,null,10054]
[null,null,10055]
[null,null,10056]
[null,null,10057]
[null,null,10058]
[null,null,10059]
[null,null,10060]
[null,null,10061]
[null,null,10062]
[null,null,10063]
[null,null,10064]
[null,null,10065]
[null,null,10066]
[null,null,10067]
[null,null,10068]
[null,null,10069]
[null,null,10070]
[null,null,10071]
[null,null,10072]
[null,null,10073]
[null,null,10074]
[null,null,10075]
[null,null,10076]
[null,null,10077]
[null,null,10078]
[null,null,10079]
[null,null,10080]
[null,null,10081]
[null,null,10082]
[null,null,10083]
[null,null,10084]
[null,null,10085]
[null,null,10086]
[null,null,10087]
[null,null,10088]
[null,null,10089]
[null,null,10090]
[null,null,10091]
[null,null,10092]
[null,null,10093]
[null,null,10094]
[null,null,10095]
[null,null,10096]
[null,null,10097]
[null,null,10098]
[null,null,10099]
[null,null,10100]
[null,null,10101]
[null,null,10102]
[null,null,10103]
[null,null,10104]
[null,null,10105]
[null,null,10106]
[null,null,10107]
[null,null,10108]
[null,null,10109]
[null,null,10110]
[null,null,10111]
[null,null,10112]
[null,null,10113]
[null,null,10114]
[null,null,10115]
[null,null,10116]
[null,null,10117]
[null,null,10118]
[null,null,10119]
[null,null,10120]
[null,null,10121]
[null,null,10122]
[null,null,10123]
[null,null,10124]
[null,null,10125]
[null,null,10126]
[null,null,10127]
[null,null,10128]
[null,null,10129]
[null,null,10130]
[null,null,10131]
[null,null,10132]
[null,null,10133]
[null,null,10134]
[null,null,10135]
[null,null,10136]
[null,null,10137]
[null,null,10138]
[null,null,10139]
[null,null,10140]
[null,null,10141]
[null,null,10142]
[null,null,10143]
[null,null,10144]
[null,null,10145]
[null,null,10146]
[null,null,10147]
[null,null,10148]
[null,null,10149]
[null,null,10150]
[null,null,10151]
[null,null,10152]
[null,null,10153]
[null,null,10154]
[null,null,10155]
[null,null,10156]
[null,null,10157]
[null,null,10158]
[null,null,10159]
[null,null,10160]
[null,null,10161]
[null,null,10162]
[null,null,10163]
[null,null,10164]
[null,null,10165]
[null,null,10166]
[null,null,10167]
[null,null,10168]
[null,null,10169]
[null,null,10170]
[null,null,10171]
[null,null,10172]
[null,null,10173]
[null,null,10174]
[null,null,10175]
[null,null,10176]
[null,null,10177]
[null,null,10178]
[null,null,10179]
[null,null,10180]
[null,null,10181]
[null,null,10182]
[null,null,10183]
[null,null,10184]
[null,null,10185]
[null,null,10186]
[null,null,10187]
[null,null,10188]
[null,null,10189]
[null,null,10190]
[null,null,10191]
[null,null,10192]
[null,null,10193]
[null,null,10194]
[null,null,10195]
[null,null,10196]
[null,null,10197]
[null,null,10198]
[null,null,10199]
[null,null,10200]
[null,null,10201]
[null,null,10202]
[null,null,10203]
[null,null,10204]
[null,null,10205]
[null,null,10206]
[null,null,10207]
[null,null,10208]
[null,null,10209]
[null,null,10210]
[null,null,10211]
[null,null,10212]
[null,null,10213]
[null,null,10214]
[null,null,10215]
[null,null,10216]
[null,null,10217]
[null,null,10218]
[null,null,10219]
[null,null,10220]
[null,null,10221]
[null,null,10222]
[null,null,10223]
[null,null,10224]
[null,null,10225]
[null,null,10226]
[null,null,10227]
[null,null,10228]
[null,null,10229]
[null,null,10230]
[null,null,10231]
[null,null,10232]
[null,null,10233]
[null,null,10234]
[null,null,10235]
[null,null,10236]
[null,null,10237]
[null,null,10238]
[null,null,10239]
[null,null,10240]
[null,null,10241]
[null,null,10242]
[null,null,10243]
[null,null,10244]
[null,null,10245]
[null,null,10246]
[null,null,10247]
[null,null,10248]
[null,null,10249]
[null,null,10250]
[null,null,10251]
[null,null,10252]
[null,null,10253]
[null,null,10254]
[null,null,10255]
[null,null,10256]
[null,null,10257]
[null,null,10258]
[null,null,10259]
[null,null,10260]
[null,null,10261]
[null,null,10262]
[null,null,10263]
[null,null,10264]
[null,null,10265]
[null,null,10266]
[null,null,10267]
[null,null,10268]
[null,null,10269]
[null,null,10270]
[null,null,10271]
[null,null,10272]
[null,null,10273]
[null,null,10274]
[null,null,10275]
[null,null,10276]
[null,null,10277]
[null,null,10278]
[null,null,10279]
[null,null,10280]
[null,null,10281]
[null,null,10282]
[null,null,10283]
[null,null,10284]
[null,null,10285]
[null,null,10286]
[null,null,10287]
[null,null,10288]
[null,null,10289]
[null,null,10290]
[null,null,10291]
[null,null,10292]
[null,null,10293]
[null,null,10294]
[null,null,10295]
[null,null,10296]
[null,null,10297]
[null,null,10298]
[null,null,10299]
[null,null,10300]
[null,null,10301]
[null,null,10302]
[null,null,10303]
[null,null,10304]
[null,null,10305]
[null,null,10306]
[null,null,10307]
[null,null,10308]
[null,null,10309]
[null,null,10310]
[null,null,10311]
[null,null,10312]
[null,null,10313]
[null,null,10314]
[null,null,10315]
[null,null,10316]
[null,null,10317]
[null,null,10318]
[null,null,10319]
[null,null,10320]
[null,null,10321]
[null,null,10322]
[null,null,10323]
[null,null,10324]
[null,null,10325]
[null,null,10326]
[null,null,10327]
[null,null,10328]
[null,null,10329]
[null,null,10330]
[null,null,10331]
[null,null,10332]
[null,null,10333]
[null,null,10334]
[null,null,10335]
[null,null,10336]
[null,null,10337]
[null,null,10338]
[null,null,10339]
[null,null,10340]
[null,null,10341]
[null,null,10342]
[null,null,10343]
[null,null,10344]
[null,null,10345]
[null,null,10346]
[null,null,10347]
[null,null,10348]
[null,null,10349]
[null,null,10350]
[null,null,10351]
[null,null,10352]
[null,null,10353]
[null,null,10354]
[null,null,10355]
[null,null,10356]
[null,null,10357]
[null,null,10358]
[null,null,10359]
[null,null,10360]
[null,null,10361]
[null,null,10362]
[null,null,10363]
[null,null,10364]
[null,null,10365]
[null,null,10366]
[null,null,10367]
[null,null,10368]
[null,null,10369]
[null,null,10370]
[null,null,10371]
[null,null,10372]
[null,null,10373]
[null,null,10374]
[null,null,10375]
[null,null,10376]
[null,null,10377]
[null,null,10378]
[null,null,10379]
[null,null,10380]
[null,null,10381]
[null,null,10382]
[null,null,10383]
[null,null,10384]
[null,null,10385]
[null,null,10386]
[null,null,10387]
[null,null,10388]
[null,null,10389]
[null,null,10390]
[null,null,10391]
[null,null,10392]
[null,null,10393]
[null,null,10394]
[null,null,10395]
[null,null,10396]
[null,null,10397]
[null,null,10398]
[null,null,10399]
[null,null,10400]
[null,null,10401]
[null,null,10402]
[null,null,10403]
[null,null,10404]
[null,null,10405]
[null,null,10406]
[null,null,10407]
[null,null,10408]
[null,null,10409]
[null,null,10410]
[null,null,10411]
[null,null,10412]
[null,null,10413]
[null,null,10414]
[null,null,10415]
[null,null,10416]
[null,null,10417]
[null,null,10418]
[null,null,10419]
[null,null,10420]
[null,null,10421]
[null,null,10422]
[null,null,10423]
[null,null,10424]
[null,null,10425]
[null,null,10426]
[null,null,10427]
[null,null,10428]
[null,null,10429]
[null,null,10430]
[null,null,10431]
[null,null,10432]
[null,null,10433]
[null,null,10434]
[null,null,10435]
[null,null,10436]
[null,null,10437]
[null,null,10438]
[null,null,10439]
[null,null,10440]
[null,null,10441]
[null,null,10442]
[null,null,10443]
[null,null,10444]
[null,null,10445]
[null,null,10446]
[null,null,10447]
[null,null,10448]
[null,null,10449]
[null,null,10450]
[null,null,10451]
[null,null,10452]
[null,null,10453]
[null,null,10454]
[null,null,10455]
[null,null,10456]
[null,null,10457]
[null,null,10458]
[null,null,10459]
[null,null,10460]
[null,null,10461]
[null,null,10462]
[null,null,10463]
[null,null,10464]
[null,null,10465]
[null,null,10466]
[null,null,10467]
[null,null,10468]
[null,null,10469]
[null,null,10470]
[null,null,10471]
[null,null,10472]
[null,null,10473]
[null,null,10474]
[null,null,10475]
[null,null,10476]
[null,null,10477]
[null,null,10478]
[null,null,10479]
[null,null,10480]
[null,null,10481]
[null,null,10482]
[null,null,10483]
[null,null,10484]
[null,null,10485]
[null,null,10486]
[null,null,10487]
[null,null,10488]
[null,null,10489]
[null,null,10490]
[null,null,10491]
[null,null,10492]
[null,null,10493]
[null,null,10494]
[null,null,10495]
[null,null,10496]
[null,null,10497]
[null,null,10498]
[null,null,10499]
[null,null,10500]
[null,null,10501]
[null,null,10502]
[null,null,10503]
[null,null,10504]
[null,null,10505]
[null,null,10506]
[null,null,10507]
[null,null,10508]
[null,null,10509]
[null,null,10510]
[null,null,10511]
[null,null,10512]
[null,null,10513]
[null,null,10514]
[null,null,10515]
[null,null,10516]
[null,null,10517]
[null,null,10518]
[null,null,10519]
[null,null,10520]
[null,null,10521]
[null,null,10522]
[null,null,10523]
[null,null,10524]
[null,null,10525]
[null,null,10526]
[null,null,10527]
[null,null,10528]
[null,null,10529]
[null,null,10530]
[null,null,10531]
[null,null,10532]
[null,null,10533]
[null,null,10534]
[null,null,10535]
[null,null,10536]
[null,null,10537]
[null,null,10538]
[null,null,10539]
[null,null,10540]
[null,null,10541]
[null,null,10542]
[null,null,10543]
[null,null,10544]
[null,null,10545]
[null,null,10546]
[null,null,10547]
[null,null,10548]
[null,null,10549]
[null,null,10550]
[null,null,10551]
[null,null,10552]
[null,null,10553]
[null,null,10554]
[null,null,10555]
[null,null,10556]
[null,null,10557]
[null,null,10558]
[null,null,10559]
[null,null,10560]
[null,null,10561]
[null,null,10562]
[null,null,10563]
[null,null,10564]
[null,null,10565]
[null,null,10566]
[null,null,10567]
[null,null,10568]
[null,null,10569]
[null,null,10570]
[null,null,10571]
[null,null,10572]
[null,null,10573]
[null,null,10574]
[null,null,10575]
[null,null,10576]
[null,null,10577]
[null,null,10578]
[null,null,10579]
[null,null,10580]
[null,null,10581]
[null,null,10582]
[null,null,10583]
[null,null,10584]
[null,null,10585]
[null,null,10586]
[null,null,10587]
[null,null,10588]
[null,null,10589]
[null,null,10590]
[null,null,10591]
[null,null,10592]
[null,null,10593]
[null,null,10594]
[null,null,10595]
[null,null,10596]
[null,null,10597]
[null,null,10598]
[null,null,10599]
[null,null,10600]
[null,null,10601]
[null,null,10602]
[null,null,10603]
[null,null,10604]
[null,null,10605]
[null,null,10606]
[null,null,10607]
[null,null,10608]
[null,null,10609]
[null,null,10610]
[null,null,10611]
[null,null,10612]
[null,null,10613]
[null,null,10614]
[null,null,10615]
[null,null,10616]
[null,null,10617]
[null,null,10618]
[null,null,10619]
[null,null,10620]
[null,null,10621]
[null,null,10622]
[null,null,10623]
[null,null,10624]
[null,null,10625]
[null,null,10626]
[null,null,10627]
[null,null,10628]
[null,null,10629]
[null,null,10630]
[null,null,10631]
[null,null,10632]
[null,null,10633]
[null,null,10634]
[null,null,10635]
[null,null,10636]
[null,null,10637]
[null,null,10638]
[null,null,10639]
[null,null,10640]
[null,null,10641]
[null,null,10642]
[null,null,10643]
[null,null,10644]
[null,null,10645]
[null,null,10646]
[null,null,10647]
[null,null,10648]
[null,null,10649]
[null,null,10650]
[null,null,10651]
[null,null,10652]
[null,null,10653]
[null,null,10654]
[null,null,10655]
[null,null,10656]
[null,null,10657]
[null,null,10658]
[null,null,10659]
[null,null,10660]
[null,null,10661]
[null,null,10662]
[null,null,10663]
[null,null,10664]
[null,null,10665]
[null,null,10666]
[null,null,10667]
[null,null,10668]
[null,null,10669]
[null,null,10670]
[null,null,10671]
[null,null,10672]
[null,null,10673]
[null,null,10674]
[null,null,10675]
[null,null,10676]
[null,null,10677]
[null,null,10678]
[null,null,10679]
[null,null,10680]
[null,null,10681]
[null,null,10682]
[null,null,10683]
[null,null,10684]
[null,null,10685]
[null,null,10686]
[null,null,10687]
[null,null,10688]
[null,null,10689]
[null,null,10690]
[null,null,10691]
[null,null,10692]
[null,null,10693]
[null,null,10694]
[null,null,10695]
[null,null,10696]
[null,null,10697]
[null,null,10698]
[null,null,10699]
[null,null,10700]
[null,null,10701]
[null,null,10702]
[null,null,10703]
[null,null,10704]
[null,null,10705]
[null,null,10706]
[null,null,10707]
[null,null,10708]
[null,null,10709]
[null,null,10710]
[null,null,10711]
[null,null,10712]
[null,null,10713]
[null,null,10714]
[null,null,10715]
[null,null,10716]
[null,null,10717]
[null,null,10718]
[null,null,10719]
[null,null,10720]
[null,null,10721]
[null,null,10722]
[null,null,10723]
[null,null,10724]
[null,null,10725]
[null,null,10726]
[null,null,10727]
[null,null,10728]
[null,null,10729]
[null,null,10730]
[null,null,10731]
[null,null,10732]
[null,null,10733]
[null,null,10734]
[null,null,10735]
[null,null,10736]
[null,null,10737]
[null,null,10738]
[null,null,10739]
[null,null,10740]
[null,null,10741]
[null,null,10742]
[null,null,10743]
[null,null,10744]
[null,null,10745]
[null,null,10746]
[null,null,10747]
[null,null,10748]
[null,null,10749]
[null,null,10750]
[null,null,10751]
[null,null,10752]
[null,null,10753]
[null,null,10754]
[null,null,10755]
[null,null,10756]
[null,null,10757]
[null,null,10758]
[null,null,10759]
[null,null,10760]
[null,null,10761]
[null,null,10762]
[null,null,10763]
[null,null,10764]
[null,null,10765]
[null,null,10766]
[null,null,10767]
[null,null,10768]
[null,null,10769]
[null,null,10770]
[null,null,10771]
[null,null,10772]
[null,null,10773]
[null,null,10774]
[null,null,10775]
[null,null,10776]
[null,null,10777]
[null,null,10778]
[null,null,10779]
[null,null,10780]
[null,null,10781]
[null,null,10782]
[null,null,10783]
[null,null,10784]
[null,null,10785]
[null,null,10786]
[null,null,10787]
[null,null,10788]
[null,null,10789]
[null,null,10790]
[null,null,10791]
[null,null,10792]
[null,null,10793]
[null,null,10794]
[null,null,10795]
[null,null,10796]
[null,null,10797]
[null,null,10798]
[null,null,10799]
[null,null,10800]
[null,null,10801]
[null,null,10802]
[null,null,10803]
[null,null,10804]
[null,null,10805]
[null,null,10806]
[null,null,10807]
[null,null,10808]
[null,null,10809]
[null,null,10810]
[null,null,10811]
[null,null,10812]
[null,null,10813]
[null,null,10814]
[null,null,10815]
[null,null,10816]
[null,null,10817]
[null,null,10818]
[null,null,10819]
[null,null,10820]
[null,null,10821]
[null,null,10822]
[null,null,10823]
[null,null,10824]
[null,null,10825]
[null,null,10826]
[null,null,10827]
[null,null,10828]
[null,null,10829]
[null,null,10830]
[null,null,10831]
[null,null,10832]
[null,null,10833]
[null,null,10834]
[null,null,10835]
[null,null,10836]
[null,null,10837]
[null,null,10838]
[null,null,10839]
[null,null,10840]
[null,null,10841]
[null,null,10842]
[null,null,10843]
[null,null,10844]
[null,null,10845]
[null,null,10846]
[null,null,10847]
[null,null,10848]
[null,null,10849]
[null,null,10850]
[null,null,10851]
[null,null,10852]
[null,null,10853]
[null,null,10854]
[null,null,10855]
[null,null,10856]
[null,null,10857]
[null,null,10858]
[null,null,10859]
[null,null,10860]
[null,null,10861]
[null,null,10862]
[null,null,10863]
[null,null,10864]
[null,null,10865]
[null,null,10866]
[null,null,10867]
[null,null,10868]
[null,null,10869]
[null,null,10870]
[null,null,10871]
[null,null,10872]
[null,null,10873]
[null,null,10874]
[null,null,10875]
[null,null,10876]
[null,null,10877]
[null,null,10878]
[null,null,10879]
[null,null,10880]
[null,null,10881]
[null,null,10882]
[null,null,10883]
[null,null,10884]
[null,null,10885]
[null,null,10886]
[null,null,10887]
[null,null,10888]
[null,null,10889]
[null,null,10890]
[null,null,10891]
[null,null,10892]
[null,null,10893]
[null,null,10894]
[null,null,10895]
[null,null,10896]
[null,null,10897]
[null,null,10898]
[null,null,10899]
[null,null,10900]
[null,null,10901]
[null,null,10902]
[null,null,10903]
[null,null,10904]
[null,null,10905]
[null,null,10906]
[null,null,10907]
[null,null,10908]
[null,null,10909]
[null,null,10910]
[null,null,10911]
[null,null,10912]
[null,null,10913]
[null,null,10914]
[null,null,10915]
[null,null,10916]
[null,null,10917]
[null,null,10918]
[null,null,10919]
[null,null,10920]
[null,null,10921]
[null,null,10922]
[null,null,10923]
[null,null,10924]
[null,null,10925]
[null,null,10926]
[null,null,10927]
[null,null,10928]
[null,null,10929]
[null,null,10930]
[null,null,10931]
[null,null,10932]
[null,null,10933]
[null,null,10934]
[null,null,10935]
[null,null,10936]
[null,null,10937]
[null,null,10938]
[null,null,10939]
[null,null,10940]
[null,null,10941]
[null,null,10942]
[null,null,10943]
[null,null,10944]
[null,null,10945]
[null,null,10946]
[null,null,10947]
[null,null,10948]
[null,null,10949]
[null,null,10950]
[null,null,10951]
[null,null,10952]
[null,null,10953]
[null,null,10954]
[null,null,10955]
[null,null,10956]
[null,null,10957]
[null,null,10958]
[null,null,10959]
[null,null,10960]
[null,null,10961]
[null,null,10962]
[null,null,10963]
[null,null,10964]
[null,null,10965]
[null,null,10966]
[null,null,10967]
[null,null,10968]
[null,null,10969]
[null,null,10970]
[null,null,10971]
[null,null,10972]
[null,null,10973]
[null,null,10974]
[null,null,10975]
[null,null,10976]
[null,null,10977]
[null,null,10978]
[null,null,10979]
[null,null,10980]
[null,null,10981]
[null,null,10982]
[null,null,10983]
[null,null,10984]
[null,null,10985]
[null,null,10986]
[null,null,10987]
[null,null,10988]
[null,null,10989]
[null,null,10990]
[null,null,10991]
[null,null,10992]
[null,null,10993]
[null,null,10994]
[null,null,10995]
[null,null,10996]
[null,null,10997]
[null,null,10998]
[null,null,10999]
[null,null,11000]
[null,null,11001]
[null,null,11002]
[null,null,11003]
[null,null,11004]
[null,null,11005]
[null,null,11006]
[null,null,11007]
[null,null,11008]
[null,null,11009]
[null,null,11010]
[null,null,11011]
[null,null,11012]
[null,null,11013]
[null,null,11014]
[null,null,11015]
[null,null,11016]
[null,null,11017]
[null,null,11018]
[null,null,11019]
[null,null,11020]
[null,null,11021]
[null,null,11022]
[null,null,11023]
[null,null,11024]
[null,null,11025]
[null,null,11026]
[null,null,11027]
[null,null,11028]
[null,null,11029]
[null,null,11030]
[null,null,11031]
[null,null,11032]
[null,null,11033]
[null,null,11034]
[null,null,11035]
[null,null,11036]
[null,null,11037]
[null,null,11038]
[null,null,11039]
[null,null,11040]
[null,null,11041]
[null,null,11042]
[null,null,11043]
[null,null,11044]
[null,null,11045]
[null,null,11046]
[null,null,11047]
[null,null,11048]
[null,null,11049]
[null,null,11050]
[null,null,11051]
[null,null,11052]
[null,null,11053]
[null,null,11054]
[null,null,11055]
[null,null,11056]
[null,null,11057]
[null,null,11058]
[null,null,11059]
[null,null,11060]
[null,null,11061]
[null,null,11062]
[null,null,11063]
[null,null,11064]
[null,null,11065]
[null,null,11066]
[null,null,11067]
[null,null,11068]
[null,null,11069]
[null,null,11070]
[null,null,11071]
[null,null,11072]
[null,null,11073]
[null,null,11074]
[null,null,11075]
[null,null,11076]
[null,null,11077]
[null,null,11078]
[null,null,11079]
[null,null,11080]
[null,null,11081]
[null,null,11082]
[null,null,11083]
[null,null,11084]
[null,null,11085]
[null,null,11086]
[null,null,11087]
[null,null,11088]
[null,null,11089]
[null,null,11090]
[null,null,11091]
[null,null,11092]
[null,null,11093]
[null,null,11094]
[null,null,11095]
[null,null,11096]
[null,null,11097]
[null,null,11098]
[null,null,11099]
[null,null,11100]
[null,null,11101]
[null,null,11102]
[null,null,11103]
[null,null,11104]
[null,null,11105]
[null,null,11106]
[null,null,11107]
[null,null,11108]
[null,null,11109]
[null,null,11110]
[null,null,11111]
[null,null,11112]
[null,null,11113]
[null,null,11114]
[null,null,11115]
[null,null,11116]
[null,null,11117]
[null,null,11118]
[null,null,11119]
[null,null,11120]
[null,null,11121]
[null,null,11122]
[null,null,11123]
[null,null,11124]
[null,null,11125]
[null,null,11126]
[null,null,11127]
[null,null,11128]
[null,null,11129]
[null,null,11130]
[null,null,11131]
[null,null,11132]
[null,null,11133]
[null,null,11134]
[null,null,11135]
[null,null,11136]
[null,null,11137]
[null,null,11138]
[null,null,11139]
[null,null,11140]
[null,null,11141]
[null,null,11142]
[null,null,11143]
[null,null,11144]
[null,null,11145]
[null,null,11146]
[null,null,11147]
[null,null,11148]
[null,null,11149]
[null,null,11150]
[null,null,11151]
[null,null,11152]
[null,null,11153]
[null,null,11154]
[null,null,11155]
[null,null,11156]
[null,null,11157]
[null,null,11158]
[null,null,11159]
[null,null,11160]
[null,null,11161]
[null,null,11162]
[null,null,11163]
[null,null,11164]
[null,null,11165]
[null,null,11166]
[null,null,11167]
[null,null,11168]
[null,null,11169]
[null,null,11170]
[null,null,11171]
[null,null,11172]
[null,null,11173]
[null,null,11174]
[null,null,11175]
[null,null,11176]
[null,null,11177]
[null,null,11178]
[null,null,11179]
[null,null,11180]
[null,null,11181]
[null,null,11182]
[null,null,11183]
[null,null,11184]
[null,null,11185]
[null,null,11186]
[null,null,11187]
[null,null,11188]
[null,null,11189]
[null,null,11190]
[null,null,11191]
[null,null,11192]
[null,null,11193]
[null,null,11194]
[null,null,11195]
[null,null,11196]
[null,null,11197]
[null,null,11198]
[null,null,11199]
[null,null,11200]
[null,null,11201]
[null,null,11202]
[null,null,11203]
[null,null,11204]
[null,null,11205]
[null,null,11206]
[null,null,11207]
[null,null,11208]
[null,null,11209]
[null,null,11210]
[null,null,11211]
[null,null,11212]
[null,null,11213]
[null,null,11214]
[null,null,11215]
[null,null,11216]
[null,null,11217]
[null,null,11218]
[null,null,11219]
[null,null,11220]
[null,null,11221]
[null,null,11222]
[null,null,11223]
[null,null,11224]
[null,null,11225]
[null,null,11226]
[null,null,11227]
[null,null,11228]
[null,null,11229]
[null,null,11230]
[null,null,11231]
[null,null,11232]
[null,null,11233]
[null,null,11234]
[null,null,11235]
[null,null,11236]
[null,null,11237]
[null,null,11238]
[null,null,11239]
[null,null,11240]
[null,null,11241]
[null,null,11242]
[null,null,11243]
[null,null,11244]
[null,null,11245]
[null,null,11246]
[null,null,11247]
[null,null,11248]
[null,null,11249]
[null,null,11250]
[null,null,11251]
[null,null,11252]
[null,null,11253]
[null,null,11254]
[null,null,11255]
[null,null,11256]
[null,null,11257]
[null,null,11258]
[null,null,11259]
[null,null,11260]
[null,null,11261]
[null,null,11262]
[null,null,11263]
[null,null,11264]
[null,null,11265]
[null,null,11266]
[null,null,11267]
[null,null,11268]
[null,null,11269]
[null,null,11270]
[null,null,11271]
[null,null,11272]
[null,null,11273]
[null,null,11274]
[null,null,11275]
[null,null,11276]
[null,null,11277]
[null,null,11278]
[null,null,11279]
[null,null,11280]
[null,null,11281]
[null,null,11282]
[null,null,11283]
[null,null,11284]
[null,null,11285]
[null,null,11286]
[null,null,11287]
[null,null,11288]
[null,null,11289]
[null,null,11290]
[null,null,11291]
[null,null,11292]
[null,null,11293]
[null,null,11294]
[null,null,11295]
[null,null,11296]
[null,null,11297]
[null,null,11298]
[null,null,11299]
[null,null,11300]
[null,null,11301]
[null,null,11302]
[null,null,11303]
[null,null,11304]
[null,null,11305]
[null,null,11306]
[null,null,11307]
[null,null,11308]
[null,null,11309]
[null,null,11310]
[null,null,11311]
[null,null,11312]
[null,null,11313]
[null,null,11314]
[null,null,11315]
[null,null,11316]
[null,null,11317]
[null,null,11318]
[null,null,11319]
[null,null,11320]
[null,null,11321]
[null,null,11322]
[null,null,11323]
[null,null,11324]
[null,null,11325]
[null,null,11326]
[null,null,11327]
[null,null,11328]
[null,null,11329]
[null,null,11330]
[null,null,11331]
[null,null,11332]
[null,null,11333]
[null,null,11334]
[null,null,11335]
[null,null,11336]
[null,null,11337]
[null,null,11338]
[null,null,11339]
[null,null,11340]
[null,null,11341]
[null,null,11342]
[null,null,11343]
[null,null,11344]
[null,null,11345]
[null,null,11346]
[null,null,11347]
[null,null,11348]
[null,null,11349]
[null,null,11350]
[null,null,11351]
[null,null,11352]
[null,null,11353]
[null,null,11354]
[null,null,11355]
[null,null,11356]
[null,null,11357]
[null,null,11358]
[null,null,11359]
[null,null,11360]
[null,null,11361]
[null,null,11362]
[null,null,11363]
[null,null,11364]
[null,null,11365]
[null,null,11366]
[null,null,11367]
[null,null,11368]
[null,null,11369]
[null,null,11370]
[null,null,11371]
[null,null,11372]
[null,null,11373]
[null,null,11374]
[null,null,11375]
[null,null,11376]
[null,null,11377]
[null,null,11378]
[null,null,11379]
[null,null,11380]
[null,null,11381]
[null,null,11382]
[null,null,11383]
[null,null,11384]
[null,null,11385]
[null,null,11386]
[null,null,11387]
[null,null,11388]
[null,null,11389]
[null,null,11390]
[null,null,11391]
[null,null,11392]
[null,null,11393]
[null,null,11394]
[null,null,11395]
[null,null,11396]
[null,null,11397]
[null,null,11398]
[null,null,11399]
[null,null,11400]
[null,null,11401]
[null,null,11402]
[null,null,11403]
[null,null,11404]
[null,null,11405]
[null,null,11406]
[null,null,11407]
[null,null,11408]
[null,null,11409]
[null,null,11410]
[null,null,11411]
[null,null,11412]
[null,null,11413]
[null,null,11414]
[null,null,11415]
[null,null,11416]
[null,null,11417]
[null,null,11418]
[null,null,11419]
[null,null,11420]
[null,null,11421]
[null,null,11422]
[null,null,11423]
[null,null,11424]
[null,null,11425]
[null,null,11426]
[null,null,11427]
[null,null,11428]
[null,null,11429]
[null,null,11430]
[null,null,11431]
[null,null,11432]
[null,null,11433]
[null,null,11434]
[null,null,11435]
[null,null,11436]
[null,null,11437]
[null,null,11438]
[null,null,11439]
[null,null,11440]
[null,null,11441]
[null,null,11442]
[null,null,11443]
[null,null,11444]
[null,null,11445]
[null,null,11446]
[null,null,11447]
[null,null,11448]
[null,null,11449]
[null,null,11450]
[null,null,11451]
[null,null,11452]
[null,null,11453]
[null,null,11454]
[null,null,11455]
[null,null,11456]
[null,null,11457]
[null,null,11458]
[null,null,11459]
[null,null,11460]
[null,null,11461]
[null,null,11462]
[null,null,11463]
[null,null,11464]
[null,null,11465]
[null,null,11466]
[null,null,11467]
[null,null,11468]
[null,null,11469]
[null,null,11470]
[null,null,11471]
[null,null,11472]
[null,null,11473]
[null,null,11474]
[null,null,11475]
[null,null,11476]
[null,null,11477]
[null,null,11478]
[null,null,11479]
[null,null,11480]
[null,null,11481]
[null,null,11482]
[null,null,11483]
[null,null,11484]
[null,null,11485]
[null,null,11486]
[null,null,11487]
[null,null,11488]
[null,null,11489]
[null,null,11490]
[null,null,11491]
[null,null,11492]
[null,null,11493]
[null,null,11494]
[null,null,11495]
[null,null,11496]
[null,null,11497]
[null,null,11498]
[null,null,11499]
[null,null,11500]
[null,null,11501]
[null,null,11502]
[null,null,11503]
[null,null,11504]
[null,null,11505]
[null,null,11506]
[null,null,11507]
[null,null,11508]
[null,null,11509]
[null,null,11510]
[null,null,11511]
[null,null,11512]
[null,null,11513]
[null,null,11514]
[null,null,11515]
[null,null,11516]
[null,null,11517]
[null,null,11518]
[null,null,11519]
[null,null,11520]
[null,null,11521]
[null,null,11522]
[null,null,11523]
[null,null,11524]
[null,null,11525]
[null,null,11526]
[null,null,11527]
[null,null,11528]
[null,null,11529]
[null,null,11530]
[null,null,11531]
[null,null,11532]
[null,null,11533]
[null,null,11534]
[null,null,11535]
[null,null,11536]
[null,null,11537]
[null,null,11538]
[null,null,11539]
[null,null,11540]
[null,null,11541]
[null,null,11542]
[null,null,11543]
[null,null,11544]
[null,null,11545]
[null,null,11546]
[null,null,11547]
[null,null,11548]
[null,null,11549]
[null,null,11550]
[null,null,11551]
[null,null,11552]
[null,null,11553]
[null,null,11554]
[null,null,11555]
[null,null,11556]
[null,null,11557]
[null,null,11558]
[null,null,11559]
[null,null,11560]
[null,null,11561]
[null,null,11562]
[null,null,11563]
[null,null,11564]
[null,null,11565]
[null,null,11566]
[null,null,11567]
[null,null,11568]
[null,null,11569]
[null,null,11570]
[null,null,11571]
[null,null,11572]
[null,null,11573]
[null,null,11574]
[null,null,11575]
[null,null,11576]
[null,null,11577]
[null,null,11578]
[null,null,11579]
[null,null,11580]
[null,null,11581]
[null,null,11582]
[null,null,11583]
[null,null,11584]
[null,null,11585]
[null,null,11586]
[null,null,11587]
[null,null,11588]
[null,null,11589]
[null,null,11590]
[null,null,11591]
[null,null,11592]
[null,null,11593]
[null,null,11594]
[null,null,11595]
[null,null,11596]
[null,null,11597]
[null,null,11598]
[null,null,11599]
[null,null,11600]
[null,null,11601]
[null,null,11602]
[null,null,11603]
[null,null,11604]
[null,null,11605]
[null,null,11606]
[null,null,11607]
[null,null,11608]
[null,null,11609]
[null,null,11610]
[null,null,11611]
[null,null,11612]
[null,null,11613]
[null,null,11614]
[null,null,11615]
[null,null,11616]
[null,null,11617]
[null,null,11618]
[null,null,11619]
[null,null,11620]
[null,null,11621]
[null,null,11622]
[null,null,11623]
[null,null,11624]
[null,null,11625]
[null,null,11626]
[null,null,11627]
[null,null,11628]
[null,null,11629]
[null,null,11630]
[null,null,11631]
[null,null,11632]
[null,null,11633]
[null,null,11634]
[null,null,11635]
[null,null,11636]
[null,null,11637]
[null,null,11638]
[null,null,11639]
[null,null,11640]
[null,null,11641]
[null,null,11642]
[null,null,11643]
[null,null,11644]
[null,null,11645]
[null,null,11646]
[null,null,11647]
[null,null,11648]
[null,null,11649]
[null,null,11650]
[null,null,11651]
[null,null,11652]
[null,null,11653]
[null,null,11654]
[null,null,11655]
[null,null,11656]
[null,null,11657]
[null,null,11658]
[null,null,11659]
[null,null,11660]
[null,null,11661]
[null,null,11662]
[null,null,11663]
[null,null,11664]
[null,null,11665]
[null,null,11666]
[null,null,11667]
[null,null,11668]
[null,null,11669]
[null,null,11670]
[null,null,11671]
[null,null,11672]
[null,null,11673]
[null,null,11674]
[null,null,11675]
[null,null,11676]
[null,null,11677]
[null,null,11678]
[null,null,11679]
[null,null,11680]
[null,null,11681]
[null,null,11682]
[null,null,11683]
[null,null,11684]
[null,null,11685]
[null,null,11686]
[null,null,11687]
[null,null,11688]
[null,null,11689]
[null,null,11690]
[null,null,11691]
[null,null,11692]
[null,null,11693]
[null,null,11694]
[null,null,11695]
[null,null,11696]
[null,null,11697]
[null,null,11698]
[null,null,11699]
[null,null,11700]
[null,null,11701]
[null,null,11702]
[null,null,11703]
[null,null,11704]
[null,null,11705]
[null,null,11706]
[null,null,11707]
[null,null,11708]
[null,null,11709]
[null,null,11710]
[null,null,11711]
[null,null,11712]
[null,null,11713]
[null,null,11714]
[null,null,11715]
[null,null,11716]
[null,null,11717]
[null,null,11718]
[null,null,11719]
[null,null,11720]
[null,null,11721]
[null,null,11722]
[null,null,11723]
[null,null,11724]
[null,null,11725]
[null,null,11726]
[null,null,11727]
[null,null,11728]
[null,null,11729]
[null,null,11730]
[null,null,11731]
[null,null,11732]
[null,null,11733]
[null,null,11734]
[null,null,11735]
[null,null,11736]
[null,null,11737]
[null,null,11738]
[null,null,11739]
[null,null,11740]
[null,null,11741]
[null,null,11742]
[null,null,11743]
[null,null,11744]
[null,null,11745]
[null,null,11746]
[null,null,11747]
[null,null,11748]
[null,null,11749]
[null,null,11750]
[null,null,11751]
[null,null,11752]
[null,null,11753]
[null,null,11754]
[null,null,11755]
[null,null,11756]
[null,null,11757]
[null,null,11758]
[null,null,11759]
[null,null,11760]
[null,null,11761]
[null,null,11762]
[null,null,11763]
[null,null,11764]
[null,null,11765]
[null,null,11766]
[null,null,11767]
[null,null,11768]
[null,null,11769]
[null,null,11770]
[null,null,11771]
[null,null,11772]
[null,null,11773]
[null,null,11774]
[null,null,11775]
[null,null,11776]
[null,null,11777]
[null,null,11778]
[null,null,11779]
[null,null,11780]
[null,null,11781]
[null,null,11782]
[null,null,11783]
[null,null,11784]
[null,null,11785]
[null,null,11786]
[null,null,11787]
[null,null,11788]
[null,null,11789]
[null,null,11790]
[null,null,11791]
[null,null,11792]
[null,null,11793]
[null,null,11794]
[null,null,11795]
[null,null,11796]
[null,null,11797]
[null,null,11798]
[null,null,11799]
[null,null,11800]
[null,null,11801]
[null,null,11802]
[null,null,11803]
[null,null,11804]
[null,null,11805]
[null,null,11806]
[null,null,11807]
[null,null,11808]
[null,null,11809]
[null,null,11810]
[null,null,11811]
[null,null,11812]
[null,null,11813]
[null,null,11814]
[null,null,11815]
[null,null,11816]
[null,null,11817]
[null,null,11818]
[null,null,11819]
[null,null,11820]
[null,null,11821]
[null,null,11822]
[null,null,11823]
[null,null,11824]
[null,null,11825]
[null,null,11826]
[null,null,11827]
[null,null,11828]
[null,null,11829]
[null,null,11830]
[null,null,11831]
[null,null,11832]
[null,null,11833]
[null,null,11834]
[null,null,11835]
[null,null,11836]
[null,null,11837]
[null,null,11838]
[null,null,11839]
[null,null,11840]
[null,null,11841]
[null,null,11842]
[null,null,11843]
[null,null,11844]
[null,null,11845]
[null,null,11846]
[null,null,11847]
[null,null,11848]
[null,null,11849]
[null,null,11850]
[null,null,11851]
[null,null,11852]
[null,null,11853]
[null,null,11854]
[null,null,11855]
[null,null,11856]
[null,null,11857]
[null,null,11858]
[null,null,11859]
[null,null,11860]
[null,null,11861]
[null,null,11862]
[null,null,11863]
[null,null,11864]
[null,null,11865]
[null,null,11866]
[null,null,11867]
[null,null,11868]
[null,null,11869]
[null,null,11870]
[null,null,11871]
[null,null,11872]
[null,null,11873]
[null,null,11874]
[null,null,11875]
[null,null,11876]
[null,null,11877]
[null,null,11878]
[null,null,11879]
[null,null,11880]
[null,null,11881]
[null,null,11882]
[null,null,11883]
[null,null,11884]
[null,null,11885]
[null,null,11886]
[null,null,11887]
[null,null,11888]
[null,null,11889]
[null,null,11890]
[null,null,11891]
[null,null,11892]
[null,null,11893]
[null,null,11894]
[null,null,11895]
[null,null,11896]
[null,null,11897]
[null,null,11898]
[null,null,11899]
[null,null,11900]
[null,null,11901]
[null,null,11902]
[null,null,11903]
[null,null,11904]
[null,null,11905]
[null,null,11906]
[null,null,11907]
[null,null,11908]
[null,null,11909]
[null,null,11910]
[null,null,11911]
[null,null,11912]
[null,null,11913]
[null,null,11914]
[null,null,11915]
[null,null,11916]
[null,null,11917]
[null,null,11918]
[null,null,11919]
[null,null,11920]
[null,null,11921]
[null,null,11922]
[null,null,11923]
[null,null,11924]
[null,null,11925]
[null,null,11926]
[null,null,11927]
[null,null,11928]
[null,null,11929]
[null,null,11930]
[null,null,11931]
[null,null,11932]
[null,null,11933]
[null,null,11934]
[null,null,11935]
[null,null,11936]
[null,null,11937]
[null,null,11938]
[null,null,11939]
[null,null,11940]
[null,null,11941]
[null,null,11942]
[null,null,11943]
[null,null,11944]
[null,null,11945]
[null,null,11946]
[null,null,11947]
[null,null,11948]
[null,null,11949]
[null,null,11950]
[null,null,11951]
[null,null,11952]
[null,null,11953]
[null,null,11954]
[null,null,11955]
[null,null,11956]
[null,null,11957]
[null,null,11958]
[null,null,11959]
[null,null,11960]
[null,null,11961]
[null,null,11962]
[null,null,11963]
[null,null,11964]
[null,null,11965]
[null,null,11966]
[null,null,11967]
[null,null,11968]
[null,null,11969]
[null,null,11970]
[null,null,11971]
[null,null,11972]
[null,null,11973]
[null,null,11974]
[null,null,11975]
[null,null,11976]
[null,null,11977]
[null,null,11978]
[null,null,11979]
[null,null,11980]
[null,null,11981]
[null,null,11982]
[null,null,11983]
[null,null,11984]
[null,null,11985]
[null,null,11986]
[null,null,11987]
[null,null,11988]
[null,null,11989]
[null,null,11990]
[null,null,11991]
[null,null,11992]
[null,null,11993]
[null,null,11994]
[null,null,11995]
[null,null,11996]
[null,null,11997]
[null,null,11998]
[null,null,11999]
[null,null,12000]
[null,null,12001]
[null,null,12002]
[null,null,12003]
[null,null,12004]
[null,null,12005]
[null,null,12006]
[null,null,12007]
[null,null,12008]
[null,null,12009]
[null,null,12010]
[null,null,12011]
[null,null,12012]
[null,null,12013]
[null,null,12014]
[null,null,12015]
[null,null,12016]
[null,null,12017]
[null,null,12018]
[null,null,12019]
[null,null,12020]
[null,null,12021]
[null,null,12022]
[null,null,12023]
[null,null,12024]
[null,null,12025]
[null,null,12026]
[null,null,12027]
[null,null,12028]
[null,null,12029]
[null,null,12030]
[null,null,12031]
[null,null,12032]
[null,null,12033]
[null,null,12034]
[null,null,12035]
[null,null,12036]
[null,null,12037]
[null,null,12038]
[null,null,12039]
[null,null,12040]
[null,null,12041]
[null,null,12042]
[null,null,12043]
[null,null,12044]
[null,null,12045]
[null,null,12046]
[null,null,12047]
[null,null,12048]
[null,null,12049]
[null,null,12050]
[null,null,12051]
[null,null,12052]
[null,null,12053]
[null,null,12054]
[null,null,12055]
[null,null,12056]
[null,null,12057]
[null,null,12058]
[null,null,12059]
[null,null,12060]
[null,null,12061]
[null,null,12062]
[null,null,12063]
[null,null,12064]
[null,null,12065]
[null,null,12066]
[null,null,12067]
[null,null,12068]
[null,null,12069]
[null,null,12070]
[null,null,12071]
[null,null,12072]
[null,null,12073]
[null,null,12074]
[null,null,12075]
[null,null,12076]
[null,null,12077]
[null,null,12078]
[null,null,12079]
[null,null,12080]
[null,null,12081]
[null,null,12082]
[null,null,12083]
[null,null,12084]
[null,null,12085]
[null,null,12086]
[null,null,12087]
[null,null,12088]
[null,null,12089]
[null,null,12090]
[null,null,12091]
[null,null,12092]
[null,null,12093]
[null,null,12094]
[null,null,12095]
[null,null,12096]
[null,null,12097]
[null,null,12098]
[null,null,12099]
[null,null,12100]
[null,null,12101]
[null,null,12102]
[null,null,12103]
[null,null,12104]
[null,null,12105]
[null,null,12106]
[null,null,12107]
[null,null,12108]
[null,null,12109]
[null,null,12110]
[null,null,12111]
[null,null,12112]
[null,null,12113]
[null,null,12114]
[null,null,12115]
[null,null,12116]
[null,null,12117]
[null,null,12118]
[null,null,12119]
[null,null,12120]
[null,null,12121]
[null,null,12122]
[null,null,12123]
[null,null,12124]
[null,null,12125]
[null,null,12126]
[null,null,12127]
[null,null,12128]
[null,null,12129]
[null,null,12130]
[null,null,12131]
[null,null,12132]
[null,null,12133]
[null,null,12134]
[null,null,12135]
[null,null,12136]
[null,null,12137]
[null,null,12138]
[null,null,12139]
[null,null,12140]
[null,null,12141]
[null,null,12142]
[null,null,12143]
[null,null,12144]
[null,null,12145]
[null,null,12146]
[null,null,12147]
[null,null,12148]
[null,null,12149]
[null,null,12150]
[null,null,12151]
[null,null,12152]
[null,null,12153]
[null,null,12154]
[null,null,12155]
[null,null,12156]
[null,null,12157]
[null,null,12158]
[null,null,12159]
[null,null,12160]
[null,null,12161]
[null,null,12162]
[null,null,12163]
[null,null,12164]
[null,null,12165]
[null,null,12166]
[null,null,12167]
[null,null,12168]
[null,null,12169]
[null,null,12170]
[null,null,12171]
[null,null,12172]
[null,null,12173]
[null,null,12174]
[null,null,12175]
[null,null,12176]
[null,null,12177]
[null,null,12178]
[null,null,12179]
[null,null,12180]
[null,null,12181]
[null,null,12182]
[null,null,12183]
[null,null,12184]
[null,null,12185]
[null,null,12186]
[null,null,12187]
[null,null,12188]
[null,null,12189]
[null,null,12190]
[null,null,12191]
[null,null,12192]
[null,null,12193]
[null,null,12194]
[null,null,12195]
[null,null,12196]
[null,null,12197]
[null,null,12198]
[null,null,12199]
[null,null,12200]
[null,null,12201]
[null,null,12202]
[null,null,12203]
[null,null,12204]
[null,null,12205]
[null,null,12206]
[null,null,12207]
[null,null,12208]
[null,null,12209]
[null,null,12210]
[null,null,12211]
[null,null,12212]
[null,null,12213]
[null,null,12214]
[null,null,12215]
[null,null,12216]
[null,null,12217]
[null,null,12218]
[null,null,12219]
[null,null,12220]
[null,null,12221]
[null,null,12222]
[null,null,12223]
[null,null,12224]
[null,null,12225]
[null,null,12226]
[null,null,12227]
[null,null,12228]
[null,null,12229]
[null,null,12230]
[null,null,12231]
[null,null,12232]
[null,null,12233]
[null,null,12234]
[null,null,12235]
[null,null,12236]
[null,null,12237]
[null,null,12238]
[null,null,12239]
[null,null,12240]
[null,null,12241]
[null,null,12242]
[null,null,12243]
[null,null,12244]
[null,null,12245]
[null,null,12246]
[null,null,12247]
[null,null,12248]
[null,null,12249]
[null,null,12250]
[null,null,12251]
[null,null,12252]
[null,null,12253]
[null,null,12254]
[null,null,12255]
[null,null,12256]
[null,null,12257]
[null,null,12258]
[null,null,12259]
[null,null,12260]
[null,null,12261]
[null,null,12262]
[null,null,12263]
[null,null,12264]
[null,null,12265]
[null,null,12266]
[null,null,12267]
[null,null,12268]
[null,null,12269]
[null,null,12270]
[null,null,12271]
[null,null,12272]
[null,null,12273]
[null,null,12274]
[null,null,12275]
[null,null,12276]
[null,null,12277]
[null,null,12278]
[null,null,12279]
[null,null,12280]
[null,null,12281]
[null,null,12282]
[null,null,12283]
[null,null,12284]
[null,null,12285]
[null,null,12286]
[null,null,12287]
[null,null,12288]
[null,null,12289]
[null,null,12290]
[null,null,12291]
[null,null,12292]
[null,null,12293]
[null,null,12294]
[null,null,12295]
[null,null,12296]
[null,null,12297]
[null,null,12298]
[null,null,12299]
[null,null,12300]
[null,null,12301]
[null,null,12302]
[null,null,12303]
[null,null,12304]
[null,null,12305]
[null,null,12306]
[null,null,12307]
[null,null,12308]
[null,null,12309]
[null,null,12310]
[null,null,12311]
[null,null,12312]
[null,null,12313]
[null,null,12314]
[null,null,12315]
[null,null,12316]
[null,null,12317]
[null,null,12318]
[null,null,12319]
[null,null,12320]
[null,null,12321]
[null,null,12322]
[null,null,12323]
[null,null,12324]
[null,null,12325]
[null,null,12326]
[null,null,12327]
[null,null,12328]
[null,null,12329]
[null,null,12330]
[null,null,12331]
[null,null,12332]
[null,null,12333]
[null,null,12334]
[null,null,12335]
[null,null,12336]
[null,null,12337]
[null,null,12338]
[null,null,12339]
[null,null,12340]
[null,null,12341]
[null,null,12342]
[null,null,12343]
[null,null,12344]
[null,null,12345]
[null,null,12346]
[null,null,12347]
[null,null,12348]
[null,null,12349]
[null,null,12350]
[null,null,12351]
[null,null,12352]
[null,null,12353]
[null,null,12354]
[null,null,12355]
[null,null,12356]
[null,null,12357]
[null,null,12358]
[null,null,12359]
[null,null,12360]
[null,null,12361]
[null,null,12362]
[null,null,12363]
[null,null,12364]
[null,null,12365]
[null,null,12366]
[null,null,12367]
[null,null,12368]
[null,null,12369]
[null,null,12370]
[null,null,12371]
[null,null,12372]
[null,null,12373]
[null,null,12374]
[null,null,12375]
[null,null,12376]
[null,null,12377]
[null,null,12378]
[null,null,12379]
[null,null,12380]
[null,null,12381]
[null,null,12382]
[null,null,12383]
[null,null,12384]
[null,null,12385]
[null,null,12386]
[null,null,12387]
[null,null,12388]
[null,null,12389]
[null,null,12390]
[null,null,12391]
[null,null,12392]
[null,null,12393]
[null,null,12394]
[null,null,12395]
[null,null,12396]
[null,null,12397]
[null,null,12398]
[null,null,12399]
[null,null,12400]
[null,null,12401]
[null,null,12402]
[null,null,12403]
[null,null,12404]
[null,null,12405]
[null,null,12406]
[null,null,12407]
[null,null,12408]
[null,null,12409]
[null,null,12410]
[null,null,12411]
[null,null,12412]
[null,null,12413]
[null,null,12414]
[null,null,12415]
[null,null,12416]
[null,null,12417]
[null,null,12418]
[null,null,12419]
[null,null,12420]
[null,null,12421]
[null,null,12422]
[null,null,12423]
[null,null,12424]
[null,null,12425]
[null,null,12426]
[null,null,12427]
[null,null,12428]
[null,null,12429]
[null,null,12430]
[null,null,12431]
[null,null,12432]
[null,null,12433]
[null,null,12434]
[null,null,12435]
[null,null,12436]
[null,null,12437]
[null,null,12438]
[null,null,12439]
[null,null,12440]
[null,null,12441]
[null,null,12442]
[null,null,12443]
[null,null,12444]
[null,null,12445]
[null,null,12446]
[null,null,12447]
[null,null,12448]
[null,null,12449]
[null,null,12450]
[null,null,12451]
[null,null,12452]
[null,null,12453]
[null,null,12454]
[null,null,12455]
[null,null,12456]
[null,null,12457]
[null,null,12458]
[null,null,12459]
[null,null,12460]
[null,null,12461]
[null,null,12462]
[null,null,12463]
[null,null,12464]
[null,null,12465]
[null,null,12466]
[null,null,12467]
[null,null,12468]
[null,null,12469]
[null,null,12470]
[null,null,12471]
[null,null,12472]
[null,null,12473]
[null,null,12474]
[null,null,12475]
[null,null,12476]
[null,null,12477]
[null,null,12478]
[null,null,12479]
[null,null,12480]
[null,null,12481]
[null,null,12482]
[null,null,12483]
[null,null,12484]
[null,null,12485]
[null,null,12486]
[null,null,12487]
[null,null,12488]
[null,null,12489]
[null,null,12490]
[null,null,12491]
[null,null,12492]
[null,null,12493]
[null,null,12494]
[null,null,12495]
[null,null,12496]
[null,null,12497]
[null,null,12498]
[null,null,12499]
[null,null,12500]
[null,null,12501]
[null,null,12502]
[null,null,12503]
[null,null,12504]
[null,null,12505]
[null,null,12506]
[null,null,12507]
[null,null,12508]
[null,null,12509]
[null,null,12510]
[null,null,12511]
[null,null,12512]
[null,null,12513]
[null,null,12514]
[null,null,12515]
[null,null,12516]
[null,null,12517]
[null,null,12518]
[null,null,12519]
[null,null,12520]
[null,null,12521]
[null,null,12522]
[null,null,12523]
[null,null,12524]
[null,null,12525]
[null,null,12526]
[null,null,12527]
[null,null,12528]
[null,null,12529]
[null,null,12530]
[null,null,12531]
[null,null,12532]
[null,null,12533]
[null,null,12534]
[null,null,12535]
[null,null,12536]
[null,null,12537]
[null,null,12538]
[null,null,12539]
[null,null,12540]
[null,null,12541]
[null,null,12542]
[null,null,12543]
[null,null,12544]
[null,null,12545]
[null,null,12546]
[null,null,12547]
[null,null,12548]
[null,null,12549]
[null,null,12550]
[null,null,12551]
[null,null,12552]
[null,null,12553]
[null,null,12554]
[null,null,12555]
[null,null,12556]
[null,null,12557]
[null,null,12558]
[null,null,12559]
[null,null,12560]
[null,null,12561]
[null,null,12562]
[null,null,12563]
[null,null,12564]
[null,null,12565]
[null,null,12566]
[null,null,12567]
[null,null,12568]
[null,null,12569]
[null,null,12570]
[null,null,12571]
[null,null,12572]
[null,null,12573]
[null,null,12574]
[null,null,12575]
[null,null,12576]
[null,null,12577]
[null,null,12578]
[null,null,12579]
[null,null,12580]
[null,null,12581]
[null,null,12582]
[null,null,12583]
[null,null,12584]
[null,null,12585]
[null,null,12586]
[null,null,12587]
[null,null,12588]
[null,null,12589]
[null,null,12590]
[null,null,12591]
[null,null,12592]
[null,null,12593]
[null,null,12594]
[null,null,12595]
[null,null,12596]
[null,null,12597]
[null,null,12598]
[null,null,12599]
[null,null,12600]
[null,null,12601]
[null,null,12602]
[null,null,12603]
[null,null,12604]
[null,null,12605]
[null,null,12606]
[null,null,12607]
[null,null,12608]
[null,null,12609]
[null,null,12610]
[null,null,12611]
[null,null,12612]
[null,null,12613]
[null,null,12614]
[null,null,12615]
[null,null,12616]
[null,null,12617]
[null,null,12618]
[null,null,12619]
[null,null,12620]
[null,null,12621]
[null,null,12622]
[null,null,12623]
[null,null,12624]
[null,null,12625]
[null,null,12626]
[null,null,12627]
[null,null,12628]
[null,null,12629]
[null,null,12630]
[null,null,12631]
[null,null,12632]
[null,null,12633]
[null,null,12634]
[null,null,12635]
[null,null,12636]
[null,null,12637]
[null,null,12638]
[null,null,12639]
[null,null,12640]
[null,null,12641]
[null,null,12642]
[null,null,12643]
[null,null,12644]
[null,null,12645]
[null,null,12646]
[null,null,12647]
[null,null,12648]
[null,null,12649]
[null,null,12650]
[null,null,12651]
[null,null,12652]
[null,null,12653]
[null,null,12654]
[null,null,12655]
[null,null,12656]
[null,null,12657]
[null,null,12658]
[null,null,12659]
[null,null,12660]
[null,null,12661]
[null,null,12662]
[null,null,12663]
[null,null,12664]
[null,null,12665]
[null,null,12666]
[null,null,12667]
[null,null,12668]
[null,null,12669]
[null,null,12670]
[null,null,12671]
[null,null,12672]
[null,null,12673]
[null,null,12674]
[null,null,12675]
[null,null,12676]
[null,null,12677]
[null,null,12678]
[null,null,12679]
[null,null,12680]
[null,null,12681]
[null,null,12682]
[null,null,12683]
[null,null,12684]
[null,null,12685]
[null,null,12686]
[null,null,12687]
[null,null,12688]
[null,null,12689]
[null,null,12690]
[null,null,12691]
[null,null,12692]
[null,null,12693]
[null,null,12694]
[null,null,12695]
[null,null,12696]
[null,null,12697]
[null,null,12698]
[null,null,12699]
[null,null,12700]
[null,null,12701]
[null,null,12702]
[null,null,12703]
[null,null,12704]
[null,null,12705]
[null,null,12706]
[null,null,12707]
[null,null,12708]
[null,null,12709]
[null,null,12710]
[null,null,12711]
[null,null,12712]
[null,null,12713]
[null,null,12714]
[null,null,12715]
[null,null,12716]
[null,null,12717]
[null,null,12718]
[null,null,12719]
[null,null,12720]
[null,null,12721]
[null,null,12722]
[null,null,12723]
[null,null,12724]
[null,null,12725]
[null,null,12726]
[null,null,12727]
[null,null,12728]
[null,null,12729]
[null,null,12730]
[null,null,12731]
[null,null,12732]
[null,null,12733]
[null,null,12734]
[null,null,12735]
[null,null,12736]
[null,null,12737]
[null,null,12738]
[null,null,12739]
[null,null,12740]
[null,null,12741]
[null,null,12742]
[null,null,12743]
[null,null,12744]
[null,null,12745]
[null,null,12746]
[null,null,12747]
[null,null,12748]
[null,null,12749]
[null,null,12750]
[null,null,12751]
[null,null,12752]
[null,null,12753]
[null,null,12754]
[null,null,12755]
[null,null,12756]
[null,null,12757]
[null,null,12758]
[null,null,12759]
[null,null,12760]
[null,null,12761]
[null,null,12762]
[null,null,12763]
[null,null,12764]
[null,null,12765]
[null,null,12766]
[null,null,12767]
[null,null,12768]
[null,null,12769]
[null,null,12770]
[null,null,12771]
[null,null,12772]
[null,null,12773]
[null,null,12774]
[null,null,12775]
[null,null,12776]
[null,null,12777]
[null,null,12778]
[null,null,12779]
[null,null,12780]
[null,null,12781]
[null,null,12782]
[null,null,12783]
[null,null,12784]
[null,null,12785]
[null,null,12786]
[null,null,12787]
[null,null,12788]
[null,null,12789]
[null,null,12790]
[null,null,12791]
[null,null,12792]
[null,null,12793]
[null,null,12794]
[null,null,12795]
[null,null,12796]
[null,null,12797]
[null,null,12798]
[null,null,12799]
[null,null,12800]
[null,null,12801]
[null,null,12802]
[null,null,12803]
[null,null,12804]
[null,null,12805]
[null,null,12806]
[null,null,12807]
[null,null,12808]
[null,null,12809]
[null,null,12810]
[null,null,12811]
[null,null,12812]
[null,null,12813]
[null,null,12814]
[null,null,12815]
[null,null,12816]
[null,null,12817]
[null,null,12818]
[null,null,12819]
[null,null,12820]
[null,null,12821]
[null,null,12822]
[null,null,12823]
[null,null,12824]
[null,null,12825]
[null,null,12826]
[null,null,12827]
[null,null,12828]
[null,null,12829]
[null,null,12830]
[null,null,12831]
[null,null,12832]
[null,null,12833]
[null,null,12834]
[null,null,12835]
[null,null,12836]
[null,null,12837]
[null,null,12838]
[null,null,12839]
[null,null,12840]
[null,null,12841]
[null,null,12842]
[null,null,12843]
[null,null,12844]
[null,null,12845]
[null,null,12846]
[null,null,12847]
[null,null,12848]
[null,null,12849]
[null,null,12850]
[null,null,12851]
[null,null,12852]
[null,null,12853]
[null,null,12854]
[null,null,12855]
[null,null,12856]
[null,null,12857]
[null,null,12858]
[null,null,12859]
[null,null,12860]
[null,null,12861]
[null,null,12862]
[null,null,12863]
[null,null,12864]
[null,null,12865]
[null,null,12866]
[null,null,12867]
[null,null,12868]
[null,null,12869]
[null,null,12870]
[null,null,12871]
[null,null,12872]
[null,null,12873]
[null,null,12874]
[null,null,12875]
[null,null,12876]
[null,null,12877]
[null,null,12878]
[null,null,12879]
[null,null,12880]
[null,null,12881]
[null,null,12882]
[null,null,12883]
[null,null,12884]
[null,null,12885]
[null,null,12886]
[null,null,12887]
[null,null,12888]
[null,null,12889]
[null,null,12890]
[null,null,12891]
[null,null,12892]
[null,null,12893]
[null,null,12894]
[null,null,12895]
[null,null,12896]
[null,null,12897]
[null,null,12898]
[null,null,12899]
[null,null,12900]
[null,null,12901]
[null,null,12902]
[null,null,12903]
[null,null,12904]
[null,null,12905]
[null,null,12906]
[null,null,12907]
[null,null,12908]
[null,null,12909]
[null,null,12910]
[null,null,12911]
[null,null,12912]
[null,null,12913]
[null,null,12914]
[null,null,12915]
[null,null,12916]
[null,null,12917]
[null,null,12918]
[null,null,12919]
[null,null,12920]
[null,null,12921]
[null,null,12922]
[null,null,12923]
[null,null,12924]
[null,null,12925]
[null,null,12926]
[null,null,12927]
[null,null,12928]
[null,null,12929]
[null,null,12930]
[null,null,12931]
[null,null,12932]
[null,null,12933]
[null,null,12934]
[null,null,12935]
[null,null,12936]
[null,null,12937]
[null,null,12938]
[null,null,12939]
[null,null,12940]
[null,null,12941]
[null,null,12942]
[null,null,12943]
[null,null,12944]
[null,null,12945]
[null,null,12946]
[null,null,12947]
[null,null,12948]
[null,null,12949]
[null,null,12950]
[null,null,12951]
[null,null,12952]
[null,null,12953]
[null,null,12954]
[null,null,12955]
[null,null,12956]
[null,null,12957]
[null,null,12958]
[null,null,12959]
[null,null,12960]
[null,null,12961]
[null,null,12962]
[null,null,12963]
[null,null,12964]
[null,null,12965]
[null,null,12966]
[null,null,12967]
[null,null,12968]
[null,null,12969]
[null,null,12970]
[null,null,12971]
[null,null,12972]
[null,null,12973]
[null,null,12974]
[null,null,12975]
[null,null,12976]
[null,null,12977]
[null,null,12978]
[null,null,12979]
[null,null,12980]
[null,null,12981]
[null,null,12982]
[null,null,12983]
[null,null,12984]
[null,null,12985]
[null,null,12986]
[null,null,12987]
[null,null,12988]
[null,null,12989]
[null,null,12990]
[null,null,12991]
[null,null,12992]
[null,null,12993]
[null,null,12994]
[null,null,12995]
[null,null,12996]
[null,null,12997]
[null,null,12998]
[null,null,12999]
[null,null,13000]
[null,null,13001]
[null,null,13002]
[null,null,13003]
[null,null,13004]
[null,null,13005]
[null,null,13006]
[null,null,13007]
[null,null,13008]
[null,null,13009]
[null,null,13010]
[null,null,13011]
[null,null,13012]
[null,null,13013]
[null,null,13014]
[null,null,13015]
[null,null,13016]
[null,null,13017]
[null,null,13018]
[null,null,13019]
[null,null,13020]
[null,null,13021]
[null,null,13022]
[null,null,13023]
[null,null,13024]
[null,null,13025]
[null,null,13026]
[null,null,13027]
[null,null,13028]
[null,null,13029]
[null,null,13030]
[null,null,13031]
[null,null,13032]
[null,null,13033]
[null,null,13034]
[null,null,13035]
[null,null,13036]
[null,null,13037]
[null,null,13038]
[null,null,13039]
[null,null,13040]
[null,null,13041]
[null,null,13042]
[null,null,13043]
[null,null,13044]
[null,null,13045]
[null,null,13046]
[null,null,13047]
[null,null,13048]
[null,null,13049]
[null,null,13050]
[null,null,13051]
[null,null,13052]
[null,null,13053]
[null,null,13054]
[null,null,13055]
[null,null,13056]
[null,null,13057]
[null,null,13058]
[null,null,13059]
[null,null,13060]
[null,null,13061]
[null,null,13062]
[null,null,13063]
[null,null,13064]
[null,null,13065]
[null,null,13066]
[null,null,13067]
[null,null,13068]
[null,null,13069]
[null,null,13070]
[null,null,13071]
[null,null,13072]
[null,null,13073]
[null,null,13074]
[null,null,13075]
[null,null,13076]
[null,null,13077]
[null,null,13078]
[null,null,13079]
[null,null,13080]
[null,null,13081]
[null,null,13082]
[null,null,13083]
[null,null,13084]
[null,null,13085]
[null,null,13086]
[null,null,13087]
[null,null,13088]
[null,null,13089]
[null,null,13090]
[null,null,13091]
[null,null,13092]
[null,null,13093]
[null,null,13094]
[null,null,13095]
[null,null,13096]
[null,null,13097]
[null,null,13098]
[null,null,13099]
[null,null,13100]
[null,null,13101]
[null,null,13102]
[null,null,13103]
[null,null,13104]
[null,null,13105]
[null,null,13106]
[null,null,13107]
[null,null,13108]
[null,null,13109]
[null,null,13110]
[null,null,13111]
[null,null,13112]
[null,null,13113]
[null,null,13114]
[null,null,13115]
[null,null,13116]
[null,null,13117]
[null,null,13118]
[null,null,13119]
[null,null,13120]
[null,null,13121]
[null,null,13122]
[null,null,13123]
[null,null,13124]
[null,null,13125]
[null,null,13126]
[null,null,13127]
[null,null,13128]
[null,null,13129]
[null,null,13130]
[null,null,13131]
[null,null,13132]
[null,null,13133]
[null,null,13134]
[null,null,13135]
[null,null,13136]
[null,null,13137]
[null,null,13138]
[null,null,13139]
[null,null,13140]
[null,null,13141]
[null,null,13142]
[null,null,13143]
[null,null,13144]
[null,null,13145]
[null,null,13146]
[null,null,13147]
[null,null,13148]
[null,null,13149]
[null,null,13150]
[null,null,13151]
[null,null,13152]
[null,null,13153]
[null,null,13154]
[null,null,13155]
[null,null,13156]
[null,null,13157]
[null,null,13158]
[null,null,13159]
[null,null,13160]
[null,null,13161]
[null,null,13162]
[null,null,13163]
[null,null,13164]
[null,null,13165]
[null,null,13166]
[null,null,13167]
[null,null,13168]
[null,null,13169]
[null,null,13170]
[null,null,13171]
[null,null,13172]
[null,null,13173]
[null,null,13174]
[null,null,13175]
[null,null,13176]
[null,null,13177]
[null,null,13178]
[null,null,13179]
[null,null,13180]
[null,null,13181]
[null,null,13182]
[null,null,13183]
[null,null,13184]
[null,null,13185]
[null,null,13186]
[null,null,13187]
[null,null,13188]
[null,null,13189]
[null,null,13190]
[null,null,13191]
[null,null,13192]
[null,null,13193]
[null,null,13194]
[null,null,13195]
[null,null,13196]
[null,null,13197]
[null,null,13198]
[null,null,13199]
[null,null,13200]
[null,null,13201]
[null,null,13202]
[null,null,13203]
[null,null,13204]
[null,null,13205]
[null,null,13206]
[null,null,13207]
[null,null,13208]
[null,null,13209]
[null,null,13210]
[null,null,13211]
[null,null,13212]
[null,null,13213]
[null,null,13214]
[null,null,13215]
[null,null,13216]
[null,null,13217]
[null,null,13218]
[null,null,13219]
[null,null,13220]
[null,null,13221]
[null,null,13222]
[null,null,13223]
[null,null,13224]
[null,null,13225]
[null,null,13226]
[null,null,13227]
[null,null,13228]
[null,null,13229]
[null,null,13230]
[null,null,13231]
[null,null,13232]
[null,null,13233]
[null,null,13234]
[null,null,13235]
[null,null,13236]
[null,null,13237]
[null,null,13238]
[null,null,13239]
[null,null,13240]
[null,null,13241]
[null,null,13242]
[null,null,13243]
[null,null,13244]
[null,null,13245]
[null,null,13246]
[null,null,13247]
[null,null,13248]
[null,null,13249]
[null,null,13250]
[null,null,13251]
[null,null,13252]
[null,null,13253]
[null,null,13254]
[null,null,13255]
[null,null,13256]
[null,null,13257]
[null,null,13258]
[null,null,13259]
[null,null,13260]
[null,null,13261]
[null,null,13262]
[null,null,13263]
[null,null,13264]
[null,null,13265]
[null,null,13266]
[null,null,13267]
[null,null,13268]
[null,null,13269]
[null,null,13270]
[null,null,13271]
[null,null,13272]
[null,null,13273]
[null,null,13274]
[null,null,13275]
[null,null,13276]
[null,null,13277]
[null,null,13278]
[null,null,13279]
[null,null,13280]
[null,null,13281]
[null,null,13282]
[null,null,13283]
[null,null,13284]
[null,null,13285]
[null,null,13286]
[null,null,13287]
[null,null,13288]
[null,null,13289]
[null,null,13290]
[null,null,13291]
[null,null,13292]
[null,null,13293]
[null,null,13294]
[null,null,13295]
[null,null,13296]
[null,null,13297]
[null,null,13298]
[null,null,13299]
[null,null,13300]
[null,null,13301]
[null,null,13302]
[null,null,13303]
[null,null,13304]
[null,null,13305]
[null,null,13306]
[null,null,13307]
[null,null,13308]
[null,null,13309]
[null,null,13310]
[null,null,13311]
[null,null,13312]
[null,null,13313]
[null,null,13314]
[null,null,13315]
[null,null,13316]
[null,null,13317]
[null,null,13318]
[null,null,13319]
[null,null,13320]
[null,null,13321]
[null,null,13322]
[null,null,13323]
[null,null,13324]
[null,null,13325]
[null,null,13326]
[null,null,13327]
[null,null,13328]
[null,null,13329]
[null,null,13330]
[null,null,13331]
[null,null,13332]
[null,null,13333]
[null,null,13334]
[null,null,13335]
[null,null,13336]
[null,null,13337]
[null,null,13338]
[null,null,13339]
[null,null,13340]
[null,null,13341]
[null,null,13342]
[null,null,13343]
[null,null,13344]
[null,null,13345]
[null,null,13346]
[null,null,13347]
[null,null,13348]
[null,null,13349]
[null,null,13350]
[null,null,13351]
[null,null,13352]
[null,null,13353]
[null,null,13354]
[null,null,13355]
[null,null,13356]
[null,null,13357]
[null,null,13358]
[null,null,13359]
[null,null,13360]
[null,null,13361]
[null,null,13362]
[null,null,13363]
[null,null,13364]
[null,null,13365]
[null,null,13366]
[null,null,13367]
[null,null,13368]
[null,null,13369]
[null,null,13370]
[null,null,13371]
[null,null,13372]
[null,null,13373]
[null,null,13374]
[null,null,13375]
[null,null,13376]
[null,null,13377]
[null,null,13378]
[null,null,13379]
[null,null,13380]
[null,null,13381]
[null,null,13382]
[null,null,13383]
[null,null,13384]
[null,null,13385]
[null,null,13386]
[null,null,13387]
[null,null,13388]
[null,null,13389]
[null,null,13390]
[null,null,13391]
[null,null,13392]
[null,null,13393]
[null,null,13394]
[null,null,13395]
[null,null,13396]
[null,null,13397]
[null,null,13398]
[null,null,13399]
[null,null,13400]
[null,null,13401]
[null,null,13402]
[null,null,13403]
[null,null,13404]
[null,null,13405]
[null,null,13406]
[null,null,13407]
[null,null,13408]
[null,null,13409]
[null,null,13410]
[null,null,13411]
[null,null,13412]
[null,null,13413]
[null,null,13414]
[null,null,13415]
[null,null,13416]
[null,null,13417]
[null,null,13418]
[null,null,13419]
[null,null,13420]
[null,null,13421]
[null,null,13422]
[null,null,13423]
[null,null,13424]
[null,null,13425]
[null,null,13426]
[null,null,13427]
[null,null,13428]
[null,null,13429]
[null,null,13430]
[null,null,13431]
[null,null,13432]
[null,null,13433]
[null,null,13434]
[null,null,13435]
[null,null,13436]
[null,null,13437]
[null,null,13438]
[null,null,13439]
[null,null,13440]
[null,null,13441]
[null,null,13442]
[null,null,13443]
[null,null,13444]
[null,null,13445]
[null,null,13446]
[null,null,13447]
[null,null,13448]
[null,null,13449]
[null,null,13450]
[null,null,13451]
[null,null,13452]
[null,null,13453]
[null,null,13454]
[null,null,13455]
[null,null,13456]
[null,null,13457]
[null,null,13458]
[null,null,13459]
[null,null,13460]
[null,null,13461]
[null,null,13462]
[null,null,13463]
[null,null,13464]
[null,null,13465]
[null,null,13466]
[null,null,13467]
[null,null,13468]
[null,null,13469]
[null,null,13470]
[null,null,13471]
[null,null,13472]
[null,null,13473]
[null,null,13474]
[null,null,13475]
[null,null,13476]
[null,null,13477]
[null,null,13478]
[null,null,13479]
[null,null,13480]
[null,null,13481]
[null,null,13482]
[null,null,13483]
[null,null,13484]
[null,null,13485]
[null,null,13486]
[null,null,13487]
[null,null,13488]
[null,null,13489]
[null,null,13490]
[null,null,13491]
[null,null,13492]
[null,null,13493]
[null,null,13494]
[null,null,13495]
[null,null,13496]
[null,null,13497]
[null,null,13498]
[null,null,13499]
[null,null,13500]
[null,null,13501]
[null,null,13502]
[null,null,13503]
[null,null,13504]
[null,null,13505]
[null,null,13506]
[null,null,13507]
[null,null,13508]
[null,null,13509]
[null,null,13510]
[null,null,13511]
[null,null,13512]
[null,null,13513]
[null,null,13514]
[null,null,13515]
[null,null,13516]
[null,null,13517]
[null,null,13518]
[null,null,13519]
[null,null,13520]
[null,null,13521]
[null,null,13522]
[null,null,13523]
[null,null,13524]
[null,null,13525]
[null,null,13526]
[null,null,13527]
[null,null,13528]
[null,null,13529]
[null,null,13530]
[null,null,13531]
[null,null,13532]
[null,null,13533]
[null,null,13534]
[null,null,13535]
[null,null,13536]
[null,null,13537]
[null,null,13538]
[null,null,13539]
[null,null,13540]
[null,null,13541]
[null,null,13542]
[null,null,13543]
[null,null,13544]
[null,null,13545]
[null,null,13546]
[null,null,13547]
[null,null,13548]
[null,null,13549]
[null,null,13550]
[null,null,13551]
[null,null,13552]
[null,null,13553]
[null,null,13554]
[null,null,13555]
[null,null,13556]
[null,null,13557]
[null,null,13558]
[null,null,13559]
[null,null,13560]
[null,null,13561]
[null,null,13562]
[null,null,13563]
[null,null,13564]
[null,null,13565]
[null,null,13566]
[null,null,13567]
[null,null,13568]
[null,null,13569]
[null,null,13570]
[null,null,13571]
[null,null,13572]
[null,null,13573]
[null,null,13574]
[null,null,13575]
[null,null,13576]
[null,null,13577]
[null,null,13578]
[null,null,13579]
[null,null,13580]
[null,null,13581]
[null,null,13582]
[null,null,13583]
[null,null,13584]
[null,null,13585]
[null,null,13586]
[null,null,13587]
[null,null,13588]
[null,null,13589]
[null,null,13590]
[null,null,13591]
[null,null,13592]
[null,null,13593]
[null,null,13594]
[null,null,13595]
[null,null,13596]
[null,null,13597]
[null,null,13598]
[null,null,13599]
[null,null,13600]
[null,null,13601]
[null,null,13602]
[null,null,13603]
[null,null,13604]
[null,null,13605]
[null,null,13606]
[null,null,13607]
[null,null,13608]
[null,null,13609]
[null,null,13610]
[null,null,13611]
[null,null,13612]
[null,null,13613]
[null,null,13614]
[null,null,13615]
[null,null,13616]
[null,null,13617]
[null,null,13618]
[null,null,13619]
[null,null,13620]
[null,null,13621]
[null,null,13622]
[null,null,13623]
[null,null,13624]
[null,null,13625]
[null,null,13626]
[null,null,13627]
[null,null,13628]
[null,null,13629]
[null,null,13630]
[null,null,13631]
[null,null,13632]
[null,null,13633]
[null,null,13634]
[null,null,13635]
[null,null,13636]
[null,null,13637]
[null,null,13638]
[null,null,13639]
[null,null,13640]
[null,null,13641]
[null,null,13642]
[null,null,13643]
[null,null,13644]
[null,null,13645]
[null,null,13646]
[null,null,13647]
[null,null,13648]
[null,null,13649]
[null,null,13650]
[null,null,13651]
[null,null,13652]
[null,null,13653]
[null,null,13654]
[null,null,13655]
[null,null,13656]
[null,null,13657]
[null,null,13658]
[null,null,13659]
[null,null,13660]
[null,null,13661]
[null,null,13662]
[null,null,13663]
[null,null,13664]
[null,null,13665]
[null,null,13666]
[null,null,13667]
[null,null,13668]
[null,null,13669]
[null,null,13670]
[null,null,13671]
[null,null,13672]
[null,null,13673]
[null,null,13674]
[null,null,13675]
[null,null,13676]
[null,null,13677]
[null,null,13678]
[null,null,13679]
[null,null,13680]
[null,null,13681]
[null,null,13682]
[null,null,13683]
[null,null,13684]
[null,null,13685]
[null,null,13686]
[null,null,13687]
[null,null,13688]
[null,null,13689]
[null,null,13690]
[null,null,13691]
[null,null,13692]
[null,null,13693]
[null,null,13694]
[null,null,13695]
[null,null,13696]
[null,null,13697]
[null,null,13698]
[null,null,13699]
[null,null,13700]
[null,null,13701]
[null,null,13702]
[null,null,13703]
[null,null,13704]
[null,null,13705]
[null,null,13706]
[null,null,13707]
[null,null,13708]
[null,null,13709]
[null,null,13710]
[null,null,13711]
[null,null,13712]
[null,null,13713]
[null,null,13714]
[null,null,13715]
[null,null,13716]
[null,null,13717]
[null,null,13718]
[null,null,13719]
[null,null,13720]
[null,null,13721]
[null,null,13722]
[null,null,13723]
[null,null,13724]
[null,null,13725]
[null,null,13726]
[null,null,13727]
[null,null,13728]
[null,null,13729]
[null,null,13730]
[null,null,13731]
[null,null,13732]
[null,null,13733]
[null,null,13734]
[null,null,13735]
[null,null,13736]
[null,null,13737]
[null,null,13738]
[null,null,13739]
[null,null,13740]
[null,null,13741]
[null,null,13742]
[null,null,13743]
[null,null,13744]
[null,null,13745]
[null,null,13746]
[null,null,13747]
[null,null,13748]
[null,null,13749]
[null,null,13750]
[null,null,13751]
[null,null,13752]
[null,null,13753]
[null,null,13754]
[null,null,13755]
[null,null,13756]
[null,null,13757]
[null,null,13758]
[null,null,13759]
[null,null,13760]
[null,null,13761]
[null,null,13762]
[null,null,13763]
[null,null,13764]
[null,null,13765]
[null,null,13766]
[null,null,13767]
[null,null,13768]
[null,null,13769]
[null,null,13770]
[null,null,13771]
[null,null,13772]
[null,null,13773]
[null,null,13774]
[null,null,13775]
[null,null,13776]
[null,null,13777]
[null,null,13778]
[null,null,13779]
[null,null,13780]
[null,null,13781]
[null,null,13782]
[null,null,13783]
[null,null,13784]
[null,null,13785]
[null,null,13786]
[null,null,13787]
[null,null,13788]
[null,null,13789]
[null,null,13790]
[null,null,13791]
[null,null,13792]
[null,null,13793]
[null,null,13794]
[null,null,13795]
[null,null,13796]
[null,null,13797]
[null,null,13798]
[null,null,13799]
[null,null,13800]
[null,null,13801]
[null,null,13802]
[null,null,13803]
[null,null,13804]
[null,null,13805]
[null,null,13806]
[null,null,13807]
[null,null,13808]
[null,null,13809]
[null,null,13810]
[null,null,13811]
[null,null,13812]
[null,null,13813]
[null,null,13814]
[null,null,13815]
[null,null,13816]
[null,null,13817]
[null,null,13818]
[null,null,13819]
[null,null,13820]
[null,null,13821]
[null,null,13822]
[null,null,13823]
[null,null,13824]
[null,null,13825]
[null,null,13826]
[null,null,13827]
[null,null,13828]
[null,null,13829]
[null,null,13830]
[null,null,13831]
[null,null,13832]
[null,null,13833]
[null,null,13834]
[null,null,13835]
[null,null,13836]
[null,null,13837]
[null,null,13838]
[null,null,13839]
[null,null,13840]
[null,null,13841]
[null,null,13842]
[null,null,13843]
[null,null,13844]
[null,null,13845]
[null,null,13846]
[null,null,13847]
[null,null,13848]
[null,null,13849]
[null,null,13850]
[null,null,13851]
[null,null,13852]
[null,null,13853]
[null,null,13854]
[null,null,13855]
[null,null,13856]
[null,null,13857]
[null,null,13858]
[null,null,13859]
[null,null,13860]
[null,null,13861]
[null,null,13862]
[null,null,13863]
[null,null,13864]
[null,null,13865]
[null,null,13866]
[null,null,13867]
[null,null,13868]
[null,null,13869]
[null,null,13870]
[null,null,13871]
[null,null,13872]
[null,null,13873]
[null,null,13874]
[null,null,13875]
[null,null,13876]
[null,null,13877]
[null,null,13878]
[null,null,13879]
[null,null,13880]
[null,null,13881]
[null,null,13882]
[null,null,13883]
[null,null,13884]
[null,null,13885]
[null,null,13886]
[null,null,13887]
[null,null,13888]
[null,null,13889]
[null,null,13890]
[null,null,13891]
[null,null,13892]
[null,null,13893]
[null,null,13894]
[null,null,13895]
[null,null,13896]
[null,null,13897]
[null,null,13898]
[null,null,13899]
[null,null,13900]
[null,null,13901]
[null,null,13902]
[null,null,13903]
[null,null,13904]
[null,null,13905]
[null,null,13906]
[null,null,13907]
[null,null,13908]
[null,null,13909]
[null,null,13910]
[null,null,13911]
[null,null,13912]
[null,null,13913]
[null,null,13914]
[null,null,13915]
[null,null,13916]
[null,null,13917]
[null,null,13918]
[null,null,13919]
[null,null,13920]
[null,null,13921]
[null,null,13922]
[null,null,13923]
[null,null,13924]
[null,null,13925]
[null,null,13926]
[null,null,13927]
[null,null,13928]
[null,null,13929]
[null,null,13930]
[null,null,13931]
[null,null,13932]
[null,null,13933]
[null,null,13934]
[null,null,13935]
[null,null,13936]
[null,null,13937]
[null,null,13938]
[null,null,13939]
[null,null,13940]
[null,null,13941]
[null,null,13942]
[null,null,13943]
[null,null,13944]
[null,null,13945]
[null,null,13946]
[null,null,13947]
[null,null,13948]
[null,null,13949]
[null,null,13950]
[null,null,13951]
[null,null,13952]
[null,null,13953]
[null,null,13954]
[null,null,13955]
[null,null,13956]
[null,null,13957]
[null,null,13958]
[null,null,13959]
[null,null,13960]
[null,null,13961]
[null,null,13962]
[null,null,13963]
[null,null,13964]
[null,null,13965]
[null,null,13966]
[null,null,13967]
[null,null,13968]
[null,null,13969]
[null,null,13970]
[null,null,13971]
[null,null,13972]
[null,null,13973]
[null,null,13974]
[null,null,13975]
[null,null,13976]
[null,null,13977]
[null,null,13978]
[null,null,13979]
[null,null,13980]
[null,null,13981]
[null,null,13982]
[null,null,13983]
[null,null,13984]
[null,null,13985]
[null,null,13986]
[null,null,13987]
[null,null,13988]
[null,null,13989]
[null,null,13990]
[null,null,13991]
[null,null,13992]
[null,null,13993]
[null,null,13994]
[null,null,13995]
[null,null,13996]
[null,null,13997]
[null,null,13998]
[null,null,13999]
[null,null,14000]
[null,null,14001]
[null,null,14002]
[null,null,14003]
[null,null,14004]
[null,null,14005]
[null,null,14006]
[null,null,14007]
[null,null,14008]
[null,null,14009]
[null,null,14010]
[null,null,14011]
[null,null,14012]
[null,null,14013]
[null,null,14014]
[null,null,14015]
[null,null,14016]
[null,null,14017]
[null,null,14018]
[null,null,14019]
[null,null,14020]
[null,null,14021]
[null,null,14022]
[null,null,14023]
[null,null,14024]
[null,null,14025]
[null,null,14026]
[null,null,14027]
[null,null,14028]
[null,null,14029]
[null,null,14030]
[null,null,14031]
[null,null,14032]
[null,null,14033]
[null,null,14034]
[null,null,14035]
[null,null,14036]
[null,null,14037]
[null,null,14038]
[null,null,14039]
[null,null,14040]
[null,null,14041]
[null,null,14042]
[null,null,14043]
[null,null,14044]
[null,null,14045]
[null,null,14046]
[null,null,14047]
[null,null,14048]
[null,null,14049]
[null,null,14050]
[null,null,14051]
[null,null,14052]
[null,null,14053]
[null,null,14054]
[null,null,14055]
[null,null,14056]
[null,null,14057]
[null,null,14058]
[null,null,14059]
[null,null,14060]
[null,null,14061]
[null,null,14062]
[null,null,14063]
[null,null,14064]
[null,null,14065]
[null,null,14066]
[null,null,14067]
[null,null,14068]
[null,null,14069]
[null,null,14070]
[null,null,14071]
[null,null,14072]
[null,null,14073]
[null,null,14074]
[null,null,14075]
[null,null,14076]
[null,null,14077]
[null,null,14078]
[null,null,14079]
[null,null,14080]
[null,null,14081]
[null,null,14082]
[null,null,14083]
[null,null,14084]
[null,null,14085]
[null,null,14086]
[null,null,14087]
[null,null,14088]
[null,null,14089]
[null,null,14090]
[null,null,14091]
[null,null,14092]
[null,null,14093]
[null,null,14094]
[null,null,14095]
[null,null,14096]
[null,null,14097]
[null,null,14098]
[null,null,14099]
[null,null,14100]
[null,null,14101]
[null,null,14102]
[null,null,14103]
[null,null,14104]
[null,null,14105]
[null,null,14106]
[null,null,14107]
[null,null,14108]
[null,null,14109]
[null,null,14110]
[null,null,14111]
[null,null,14112]
[null,null,14113]
[null,null,14114]
[null,null,14115]
[null,null,14116]
[null,null,14117]
[null,null,14118]
[null,null,14119]
[null,null,14120]
[null,null,14121]
[null,null,14122]
[null,null,14123]
[null,null,14124]
[null,null,14125]
[null,null,14126]
[null,null,14127]
[null,null,14128]
[null,null,14129]
[null,null,14130]
[null,null,14131]
[null,null,14132]
[null,null,14133]
[null,null,14134]
[null,null,14135]
[null,null,14136]
[null,null,14137]
[null,null,14138]
[null,null,14139]
[null,null,14140]
[null,null,14141]
[null,null,14142]
[null,null,14143]
[null,null,14144]
[null,null,14145]
[null,null,14146]
[null,null,14147]
[null,null,14148]
[null,null,14149]
[null,null,14150]
[null,null,14151]
[null,null,14152]
[null,null,14153]
[null,null,14154]
[null,null,14155]
[null,null,14156]
[null,null,14157]
[null,null,14158]
[null,null,14159]
[null,null,14160]
[null,null,14161]
[null,null,14162]
[null,null,14163]
[null,null,14164]
[null,null,14165]
[null,null,14166]
[null,null,14167]
[null,null,14168]
[null,null,14169]
[null,null,14170]
[null,null,14171]
[null,null,14172]
[null,null,14173]
[null,null,14174]
[null,null,14175]
[null,null,14176]
[null,null,14177]
[null,null,14178]
[null,null,14179]
[null,null,14180]
[null,null,14181]
[null,null,14182]
[null,null,14183]
[null,null,14184]
[null,null,14185]
[null,null,14186]
[null,null,14187]
[null,null,14188]
[null,null,14189]
[null,null,14190]
[null,null,14191]
[null,null,14192]
[null,null,14193]
[null,null,14194]
[null,null,14195]
[null,null,14196]
[null,null,14197]
[null,null,14198]
[null,null,14199]
[null,null,14200]
[null,null,14201]
[null,null,14202]
[null,null,14203]
[null,null,14204]
[null,null,14205]
[null,null,14206]
[null,null,14207]
[null,null,14208]
[null,null,14209]
[null,null,14210]
[null,null,14211]
[null,null,14212]
[null,null,14213]
[null,null,14214]
[null,null,14215]
[null,null,14216]
[null,null,14217]
[null,null,14218]
[null,null,14219]
[null,null,14220]
[null,null,14221]
[null,null,14222]
[null,null,14223]
[null,null,14224]
[null,null,14225]
[null,null,14226]
[null,null,14227]
[null,null,14228]
[null,null,14229]
[null,null,14230]
[null,null,14231]
[null,null,14232]
[null,null,14233]
[null,null,14234]
[null,null,14235]
[null,null,14236]
[null,null,14237]
[null,null,14238]
[null,null,14239]
[null,null,14240]
[null,null,14241]
[null,null,14242]
[null,null,14243]
[null,null,14244]
[null,null,14245]
[null,null,14246]
[null,null,14247]
[null,null,14248]
[null,null,14249]
[null,null,14250]
[null,null,14251]
[null,null,14252]
[null,null,14253]
[null,null,14254]
[null,null,14255]
[null,null,14256]
[null,null,14257]
[null,null,14258]
[null,null,14259]
[null,null,14260]
[null,null,14261]
[null,null,14262]
[null,null,14263]
[null,null,14264]
[null,null,14265]
[null,null,14266]
[null,null,14267]
[null,null,14268]
[null,null,14269]
[null,null,14270]
[null,null,14271]
[null,null,14272]
[null,null,14273]
[null,null,14274]
[null,null,14275]
[null,null,14276]
[null,null,14277]
[null,null,14278]
[null,null,14279]
[null,null,14280]
[null,null,14281]
[null,null,14282]
[null,null,14283]
[null,null,14284]
[null,null,14285]
[null,null,14286]
[null,null,14287]
[null,null,14288]
[null,null,14289]
[null,null,14290]
[null,null,14291]
[null,null,14292]
[null,null,14293]
[null,null,14294]
[null,null,14295]
[null,null,14296]
[null,null,14297]
[null,null,14298]
[null,null,14299]
[null,null,14300]
[null,null,14301]
[null,null,14302]
[null,null,14303]
[null,null,14304]
[null,null,14305]
[null,null,14306]
[null,null,14307]
[null,null,14308]
[null,null,14309]
[null,null,14310]
[null,null,14311]
[null,null,14312]
[null,null,14313]
[null,null,14314]
[null,null,14315]
[null,null,14316]
[null,null,14317]
[null,null,14318]
[null,null,14319]
[null,null,14320]
[null,null,14321]
[null,null,14322]
[null,null,14323]
[null,null,14324]
[null,null,14325]
[null,null,14326]
[null,null,14327]
[null,null,14328]
[null,null,14329]
[null,null,14330]
[null,null,14331]
[null,null,14332]
[null,null,14333]
[null,null,14334]
[null,null,14335]
[null,null,14336]
[null,null,14337]
[null,null,14338]
[null,null,14339]
[null,null,14340]
[null,null,14341]
[null,null,14342]
[null,null,14343]
[null,null,14344]
[null,null,14345]
[null,null,14346]
[null,null,14347]
[null,null,14348]
[null,null,14349]
[null,null,14350]
[null,null,14351]
[null,null,14352]
[null,null,14353]
[null,null,14354]
[null,null,14355]
[null,null,14356]
[null,null,14357]
[null,null,14358]
[null,null,14359]
[null,null,14360]
[null,null,14361]
[null,null,14362]
[null,null,14363]
[null,null,14364]
[null,null,14365]
[null,null,14366]
[null,null,14367]
[null,null,14368]
[null,null,14369]
[null,null,14370]
[null,null,14371]
[null,null,14372]
[null,null,14373]
[null,null,14374]
[null,null,14375]
[null,null,14376]
[null,null,14377]
[null,null,14378]
[null,null,14379]
[null,null,14380]
[null,null,14381]
[null,null,14382]
[null,null,14383]
[null,null,14384]
[null,null,14385]
[null,null,14386]
[null,null,14387]
[null,null,14388]
[null,null,14389]
[null,null,14390]
[null,null,14391]
[null,null,14392]
[null,null,14393]
[null,null,14394]
[null,null,14395]
[null,null,14396]
[null,null,14397]
[null,null,14398]
[null,null,14399]
[null,null,14400]
[null,null,14401]
[null,null,14402]
[null,null,14403]
[null,null,14404]
[null,null,14405]
[null,null,14406]
[null,null,14407]
[null,null,14408]
[null,null,14409]
[null,null,14410]
[null,null,14411]
[null,null,14412]
[null,null,14413]
[null,null,14414]
[null,null,14415]
[null,null,14416]
[null,null,14417]
[null,null,14418]
[null,null,14419]
[null,null,14420]
[null,null,14421]
[null,null,14422]
[null,null,14423]
[null,null,14424]
[null,null,14425]
[null,null,14426]
[null,null,14427]
[null,null,14428]
[null,null,14429]
[null,null,14430]
[null,null,14431]
[null,null,14432]
[null,null,14433]
[null,null,14434]
[null,null,14435]
[null,null,14436]
[null,null,14437]
[null,null,14438]
[null,null,14439]
[null,null,14440]
[null,null,14441]
[null,null,14442]
[null,null,14443]
[null,null,14444]
[null,null,14445]
[null,null,14446]
[null,null,14447]
[null,null,14448]
[null,null,14449]
[null,null,14450]
[null,null,14451]
[null,null,14452]
[null,null,14453]
[null,null,14454]
[null,null,14455]
[null,null,14456]
[null,null,14457]
[null,null,14458]
[null,null,14459]
[null,null,14460]
[null,null,14461]
[null,null,14462]
[null,null,14463]
[null,null,14464]
[null,null,14465]
[null,null,14466]
[null,null,14467]
[null,null,14468]
[null,null,14469]
[null,null,14470]
[null,null,14471]
[null,null,14472]
[null,null,14473]
[null,null,14474]
[null,null,14475]
[null,null,14476]
[null,null,14477]
[null,null,14478]
[null,null,14479]
[null,null,14480]
[null,null,14481]
[null,null,14482]
[null,null,14483]
[null,null,14484]
[null,null,14485]
[null,null,14486]
[null,null,14487]
[null,null,14488]
[null,null,14489]
[null,null,14490]
[null,null,14491]
[null,null,14492]
[null,null,14493]
[null,null,14494]
[null,null,14495]
[null,null,14496]
[null,null,14497]
[null,null,14498]
[null,null,14499]
[null,null,14500]
[null,null,14501]
[null,null,14502]
[null,null,14503]
[null,null,14504]
[null,null,14505]
[null,null,14506]
[null,null,14507]
[null,null,14508]
[null,null,14509]
[null,null,14510]
[null,null,14511]
[null,null,14512]
[null,null,14513]
[null,null,14514]
[null,null,14515]
[null,null,14516]
[null,null,14517]
[null,null,14518]
[null,null,14519]
[null,null,14520]
[null,null,14521]
[null,null,14522]
[null,null,14523]
[null,null,14524]
[null,null,14525]
[null,null,14526]
[null,null,14527]
[null,null,14528]
[null,null,14529]
[null,null,14530]
[null,null,14531]
[null,null,14532]
[null,null,14533]
[null,null,14534]
[null,null,14535]
[null,null,14536]
[null,null,14537]
[null,null,14538]
[null,null,14539]
[null,null,14540]
[null,null,14541]
[null,null,14542]
[null,null,14543]
[null,null,14544]
[null,null,14545]
[null,null,14546]
[null,null,14547]
[null,null,14548]
[null,null,14549]
[null,null,14550]
[null,null,14551]
[null,null,14552]
[null,null,14553]
[null,null,14554]
[null,null,14555]
[null,null,14556]
[null,null,14557]
[null,null,14558]
[null,null,14559]
[null,null,14560]
[null,null,14561]
[null,null,14562]
[null,null,14563]
[null,null,14564]
[null,null,14565]
[null,null,14566]
[null,null,14567]
[null,null,14568]
[null,null,14569]
[null,null,14570]
[null,null,14571]
[null,null,14572]
[null,null,14573]
[null,null,14574]
[null,null,14575]
[null,null,14576]
[null,null,14577]
[null,null,14578]
[null,null,14579]
[null,null,14580]
[null,null,14581]
[null,null,14582]
[null,null,14583]
[null,null,14584]
[null,null,14585]
[null,null,14586]
[null,null,14587]
[null,null,14588]
[null,null,14589]
[null,null,14590]
[null,null,14591]
[null,null,14592]
[null,null,14593]
[null,null,14594]
[null,null,14595]
[null,null,14596]
[null,null,14597]
[null,null,14598]
[null,null,14599]
[null,null,14600]
[null,null,14601]
[null,null,14602]
[null,null,14603]
[null,null,14604]
[null,null,14605]
[null,null,14606]
[null,null,14607]
[null,null,14608]
[null,null,14609]
[null,null,14610]
[null,null,14611]
[null,null,14612]
[null,null,14613]
[null,null,14614]
[null,null,14615]
[null,null,14616]
[null,null,14617]
[null,null,14618]
[null,null,14619]
[null,null,14620]
[null,null,14621]
[null,null,14622]
[null,null,14623]
[null,null,14624]
[null,null,14625]
[null,null,14626]
[null,null,14627]
[null,null,14628]
[null,null,14629]
[null,null,14630]
[null,null,14631]
[null,null,14632]
[null,null,14633]
[null,null,14634]
[null,null,14635]
[null,null,14636]
[null,null,14637]
[null,null,14638]
[null,null,14639]
[null,null,14640]
[null,null,14641]
[null,null,14642]
[null,null,14643]
[null,null,14644]
[null,null,14645]
[null,null,14646]
[null,null,14647]
[null,null,14648]
[null,null,14649]
[null,null,14650]
[null,null,14651]
[null,null,14652]
[null,null,14653]
[null,null,14654]
[null,null,14655]
[null,null,14656]
[null,null,14657]
[null,null,14658]
[null,null,14659]
[null,null,14660]
[null,null,14661]
[null,null,14662]
[null,null,14663]
[null,null,14664]
[null,null,14665]
[null,null,14666]
[null,null,14667]
[null,null,14668]
[null,null,14669]
[null,null,14670]
[null,null,14671]
[null,null,14672]
[null,null,14673]
[null,null,14674]
[null,null,14675]
[null,null,14676]
[null,null,14677]
[null,null,14678]
[null,null,14679]
[null,null,14680]
[null,null,14681]
[null,null,14682]
[null,null,14683]
[null,null,14684]
[null,null,14685]
[null,null,14686]
[null,null,14687]
[null,null,14688]
[null,null,14689]
[null,null,14690]
[null,null,14691]
[null,null,14692]
[null,null,14693]
[null,null,14694]
[null,null,14695]
[null,null,14696]
[null,null,14697]
[null,null,14698]
[null,null,14699]
[null,null,14700]
[null,null,14701]
[null,null,14702]
[null,null,14703]
[null,null,14704]
[null,null,14705]
[null,null,14706]
[null,null,14707]
[null,null,14708]
[null,null,14709]
[null,null,14710]
[null,null,14711]
[null,null,14712]
[null,null,14713]
[null,null,14714]
[null,null,14715]
[null,null,14716]
[null,null,14717]
[null,null,14718]
[null,null,14719]
[null,null,14720]
[null,null,14721]
[null,null,14722]
[null,null,14723]
[null,null,14724]
[null,null,14725]
[null,null,14726]
[null,null,14727]
[null,null,14728]
[null,null,14729]
[null,null,14730]
[null,null,14731]
[null,null,14732]
[null,null,14733]
[null,null,14734]
[null,null,14735]
[null,null,14736]
[null,null,14737]
[null,null,14738]
[null,null,14739]
[null,null,14740]
[null,null,14741]
[null,null,14742]
[null,null,14743]
[null,null,14744]
[null,null,14745]
[null,null,14746]
[null,null,14747]
[null,null,14748]
[null,null,14749]
[null,null,14750]
[null,null,14751]
[null,null,14752]
[null,null,14753]
[null,null,14754]
[null,null,14755]
[null,null,14756]
[null,null,14757]
[null,null,14758]
[null,null,14759]
[null,null,14760]
[null,null,14761]
[null,null,14762]
[null,null,14763]
[null,null,14764]
[null,null,14765]
[null,null,14766]
[null,null,14767]
[null,null,14768]
[null,null,14769]
[null,null,14770]
[null,null,14771]
[null,null,14772]
[null,null,14773]
[null,null,14774]
[null,null,14775]
[null,null,14776]
[null,null,14777]
[null,null,14778]
[null,null,14779]
[null,null,14780]
[null,null,14781]
[null,null,14782]
[null,null,14783]
[null,null,14784]
[null,null,14785]
[null,null,14786]
[null,null,14787]
[null,null,14788]
[null,null,14789]
[null,null,14790]
[null,null,14791]
[null,null,14792]
[null,null,14793]
[null,null,14794]
[null,null,14795]
[null,null,14796]
[null,null,14797]
[null,null,14798]
[null,null,14799]
[null,null,14800]
[null,null,14801]
[null,null,14802]
[null,null,14803]
[null,null,14804]
[null,null,14805]
[null,null,14806]
[null,null,14807]
[null,null,14808]
[null,null,14809]
[null,null,14810]
[null,null,14811]
[null,null,14812]
[null,null,14813]
[null,null,14814]
[null,null,14815]
[null,null,14816]
[null,null,14817]
[null,null,14818]
[null,null,14819]
[null,null,14820]
[null,null,14821]
[null,null,14822]
[null,null,14823]
[null,null,14824]
[null,null,14825]
[null,null,14826]
[null,null,14827]
[null,null,14828]
[null,null,14829]
[null,null,14830]
[null,null,14831]
[null,null,14832]
[null,null,14833]
[null,null,14834]
[null,null,14835]
[null,null,14836]
[null,null,14837]
[null,null,14838]
[null,null,14839]
[null,null,14840]
[null,null,14841]
[null,null,14842]
[null,null,14843]
[null,null,14844]
[null,null,14845]
[null,null,14846]
[null,null,14847]
[null,null,14848]
[null,null,14849]
[null,null,14850]
[null,null,14851]
[null,null,14852]
[null,null,14853]
[null,null,14854]
[null,null,14855]
[null,null,14856]
[null,null,14857]
[null,null,14858]
[null,null,14859]
[null,null,14860]
[null,null,14861]
[null,null,14862]
[null,null,14863]
[null,null,14864]
[null,null,14865]
[null,null,14866]
[null,null,14867]
[null,null,14868]
[null,null,14869]
[null,null,14870]
[null,null,14871]
[null,null,14872]
[null,null,14873]
[null,null,14874]
[null,null,14875]
[null,null,14876]
[null,null,14877]
[null,null,14878]
[null,null,14879]
[null,null,14880]
[null,null,14881]
[null,null,14882]
[null,null,14883]
[null,null,14884]
[null,null,14885]
[null,null,14886]
[null,null,14887]
[null,null,14888]
[null,null,14889]
[null,null,14890]
[null,null,14891]
[null,null,14892]
[null,null,14893]
[null,null,14894]
[null,null,14895]
[null,null,14896]
[null,null,14897]
[null,null,14898]
[null,null,14899]
[null,null,14900]
[null,null,14901]
[null,null,14902]
[null,null,14903]
[null,null,14904]
[null,null,14905]
[null,null,14906]
[null,null,14907]
[null,null,14908]
[null,null,14909]
[null,null,14910]
[null,null,14911]
[null,null,14912]
[null,null,14913]
[null,null,14914]
[null,null,14915]
[null,null,14916]
[null,null,14917]
[null,null,14918]
[null,null,14919]
[null,null,14920]
[null,null,14921]
[null,null,14922]
[null,null,14923]
[null,null,14924]
[null,null,14925]
[null,null,14926]
[null,null,14927]
[null,null,14928]
[null,null,14929]
[null,null,14930]
[null,null,14931]
[null,null,14932]
[null,null,14933]
[null,null,14934]
[null,null,14935]
[null,null,14936]
[null,null,14937]
[null,null,14938]
[null,null,14939]
[null,null,14940]
[null,null,14941]
[null,null,14942]
[null,null,14943]
[null,null,14944]
[null,null,14945]
[null,null,14946]
[null,null,14947]
[null,null,14948]
[null,null,14949]
[null,null,14950]
[null,null,14951]
[null,null,14952]
[null,null,14953]
[null,null,14954]
[null,null,14955]
[null,null,14956]
[null,null,14957]
[null,null,14958]
[null,null,14959]
[null,null,14960]
[null,null,14961]
[null,null,14962]
[null,null,14963]
[null,null,14964]
[null,null,14965]
[null,null,14966]
[null,null,14967]
[null,null,14968]
[null,null,14969]
[null,null,14970]
[null,null,14971]
[null,null,14972]
[null,null,14973]
[null,null,14974]
[null,null,14975]
[null,null,14976]
[null,null,14977]
[null,null,14978]
[null,null,14979]
[null,null,14980]
[null,null,14981]
[null,null,14982]
[null,null,14983]
[null,null,14984]
[null,null,14985]
[null,null,14986]
[null,null,14987]
[null,null,14988]
[null,null,14989]
[null,null,14990]
[null,null,14991]
[null,null,14992]
[null,null,14993]
[null,null,14994]
[null,null,14995]
[null,null,14996]
[null,null,14997]
[null,null,14998]
[null,null,14999]
[null,null,15000]
[null,null,15001]
[null,null,15002]
[null,null,15003]
[null,null,15004]
[null,null,15005]
[null,null,15006]
[null,null,15007]
[null,null,15008]
[null,null,15009]
[null,null,15010]
[null,null,15011]
[null,null,15012]
[null,null,15013]
[null,null,15014]
[null,null,15015]
[null,null,15016]
[null,null,15017]
[null,null,15018]
[null,null,15019]
[null,null,15020]
[null,null,15021]
[null,null,15022]
[null,null,15023]
[null,null,15024]
[null,null,15025]
[null,null,15026]
[null,null,15027]
[null,null,15028]
[null,null,15029]
[null,null,15030]
[null,null,15031]
[null,null,15032]
[null,null,15033]
[null,null,15034]
[null,null,15035]
[null,null,15036]
[null,null,15037]
[null,null,15038]
[null,null,15039]
[null,null,15040]
[null,null,15041]
[null,null,15042]
[null,null,15043]
[null,null,15044]
[null,null,15045]
[null,null,15046]
[null,null,15047]
[null,null,15048]
[null,null,15049]
[null,null,15050]
[null,null,15051]
[null,null,15052]
[null,null,15053]
[null,null,15054]
[null,null,15055]
[null,null,15056]
[null,null,15057]
[null,null,15058]
[null,null,15059]
[null,null,15060]
[null,null,15061]
[null,null,15062]
[null,null,15063]
[null,null,15064]
[null,null,15065]
[null,null,15066]
[null,null,15067]
[null,null,15068]
[null,null,15069]
[null,null,15070]
[null,null,15071]
[null,null,15072]
[null,null,15073]
[null,null,15074]
[null,null,15075]
[null,null,15076]
[null,null,15077]
[null,null,15078]
[null,null,15079]
[null,null,15080]
[null,null,15081]
[null,null,15082]
[null,null,15083]
[null,null,15084]
[null,null,15085]
[null,null,15086]
[null,null,15087]
[null,null,15088]
[null,null,15089]
[null,null,15090]
[null,null,15091]
[null,null,15092]
[null,null,15093]
[null,null,15094]
[null,null,15095]
[null,null,15096]
[null,null,15097]
[null,null,15098]
[null,null,15099]
[null,null,15100]
[null,null,15101]
[null,null,15102]
[null,null,15103]
[null,null,15104]
[null,null,15105]
[null,null,15106]
[null,null,15107]
[null,null,15108]
[null,null,15109]
[null,null,15110]
[null,null,15111]
[null,null,15112]
[null,null,15113]
[null,null,15114]
[null,null,15115]
[null,null,15116]
[null,null,15117]
[null,null,15118]
[null,null,15119]
[null,null,15120]
[null,null,15121]
[null,null,15122]
[null,null,15123]
[null,null,15124]
[null,null,15125]
[null,null,15126]
[null,null,15127]
[null,null,15128]
[null,null,15129]
[null,null,15130]
[null,null,15131]
[null,null,15132]
[null,null,15133]
[null,null,15134]
[null,null,15135]
[null,null,15136]
[null,null,15137]
[null,null,15138]
[null,null,15139]
[null,null,15140]
[null,null,15141]
[null,null,15142]
[null,null,15143]
[null,null,15144]
[null,null,15145]
[null,null,15146]
[null,null,15147]
[null,null,15148]
[null,null,15149]
[null,null,15150]
[null,null,15151]
[null,null,15152]
[null,null,15153]
[null,null,15154]
[null,null,15155]
[null,null,15156]
[null,null,15157]
[null,null,15158]
[null,null,15159]
[null,null,15160]
[null,null,15161]
[null,null,15162]
[null,null,15163]
[null,null,15164]
[null,null,15165]
[null,null,15166]
[null,null,15167]
[null,null,15168]
[null,null,15169]
[null,null,15170]
[null,null,15171]
[null,null,15172]
[null,null,15173]
[null,null,15174]
[null,null,15175]
[null,null,15176]
[null,null,15177]
[null,null,15178]
[null,null,15179]
[null,null,15180]
[null,null,15181]
[null,null,15182]
[null,null,15183]
[null,null,15184]
[null,null,15185]
[null,null,15186]
[null,null,15187]
[null,null,15188]
[null,null,15189]
[null,null,15190]
[null,null,15191]
[null,null,15192]
[null,null,15193]
[null,null,15194]
[null,null,15195]
[null,null,15196]
[null,null,15197]
[null,null,15198]
[null,null,15199]
[null,null,15200]
[null,null,15201]
[null,null,15202]
[null,null,15203]
[null,null,15204]
[null,null,15205]
[null,null,15206]
[null,null,15207]
[null,null,15208]
[null,null,15209]
[null,null,15210]
[null,null,15211]
[null,null,15212]
[null,null,15213]
[null,null,15214]
[null,null,15215]
[null,null,15216]
[null,null,15217]
[null,null,15218]
[null,null,15219]
[null,null,15220]
[null,null,15221]
[null,null,15222]
[null,null,15223]
[null,null,15224]
[null,null,15225]
[null,null,15226]
[null,null,15227]
[null,null,15228]
[null,null,15229]
[null,null,15230]
[null,null,15231]
[null,null,15232]
[null,null,15233]
[null,null,15234]
[null,null,15235]
[null,null,15236]
[null,null,15237]
[null,null,15238]
[null,null,15239]
[null,null,15240]
[null,null,15241]
[null,null,15242]
[null,null,15243]
[null,null,15244]
[null,null,15245]
[null,null,15246]
[null,null,15247]
[null,null,15248]
[null,null,15249]
[null,null,15250]
[null,null,15251]
[null,null,15252]
[null,null,15253]
[null,null,15254]
[null,null,15255]
[null,null,15256]
[null,null,15257]
[null,null,15258]
[null,null,15259]
[null,null,15260]
[null,null,15261]
[null,null,15262]
[null,null,15263]
[null,null,15264]
[null,null,15265]
[null,null,15266]
[null,null,15267]
[null,null,15268]
[null,null,15269]
[null,null,15270]
[null,null,15271]
[null,null,15272]
[null,null,15273]
[null,null,15274]
[null,null,15275]
[null,null,15276]
[null,null,15277]
[null,null,15278]
[null,null,15279]
[null,null,15280]
[null,null,15281]
[null,null,15282]
[null,null,15283]
[null,null,15284]
[null,null,15285]
[null,null,15286]
[null,null,15287]
[null,null,15288]
[null,null,15289]
[null,null,15290]
[null,null,15291]
[null,null,15292]
[null,null,15293]
[null,null,15294]
[null,null,15295]
[null,null,15296]
[null,null,15297]
[null,null,15298]
[null,null,15299]
[null,null,15300]
[null,null,15301]
[null,null,15302]
[null,null,15303]
[null,null,15304]
[null,null,15305]
[null,null,15306]
[null,null,15307]
[null,null,15308]
[null,null,15309]
[null,null,15310]
[null,null,15311]
[null,null,15312]
[null,null,15313]
[null,null,15314]
[null,null,15315]
[null,null,15316]
[null,null,15317]
[null,null,15318]
[null,null,15319]
[null,null,15320]
[null,null,15321]
[null,null,15322]
[null,null,15323]
[null,null,15324]
[null,null,15325]
[null,null,15326]
[null,null,15327]
[null,null,15328]
[null,null,15329]
[null,null,15330]
[null,null,15331]
[null,null,15332]
[null,null,15333]
[null,null,15334]
[null,null,15335]
[null,null,15336]
[null,null,15337]
[null,null,15338]
[null,null,15339]
[null,null,15340]
[null,null,15341]
[null,null,15342]
[null,null,15343]
[null,null,15344]
[null,null,15345]
[null,null,15346]
[null,null,15347]
[null,null,15348]
[null,null,15349]
[null,null,15350]
[null,null,15351]
[null,null,15352]
[null,null,15353]
[null,null,15354]
[null,null,15355]
[null,null,15356]
[null,null,15357]
[null,null,15358]
[null,null,15359]
[null,null,15360]
[null,null,15361]
[null,null,15362]
[null,null,15363]
[null,null,15364]
[null,null,15365]
[null,null,15366]
[null,null,15367]
[null,null,15368]
[null,null,15369]
[null,null,15370]
[null,null,15371]
[null,null,15372]
[null,null,15373]
[null,null,15374]
[null,null,15375]
[null,null,15376]
[null,null,15377]
[null,null,15378]
[null,null,15379]
[null,null,15380]
[null,null,15381]
[null,null,15382]
[null,null,15383]
[null,null,15384]
[null,null,15385]
[null,null,15386]
[null,null,15387]
[null,null,15388]
[null,null,15389]
[null,null,15390]
[null,null,15391]
[null,null,15392]
[null,null,15393]
[null,null,15394]
[null,null,15395]
[null,null,15396]
[null,null,15397]
[null,null,15398]
[null,null,15399]
[null,null,15400]
[null,null,15401]
[null,null,15402]
[null,null,15403]
[null,null,15404]
[null,null,15405]
[null,null,15406]
[null,null,15407]
[null,null,15408]
[null,null,15409]
[null,null,15410]
[null,null,15411]
[null,null,15412]
[null,null,15413]
[null,null,15414]
[null,null,15415]
[null,null,15416]
[null,null,15417]
[null,null,15418]
[null,null,15419]
[null,null,15420]
[null,null,15421]
[null,null,15422]
[null,null,15423]
[null,null,15424]
[null,null,15425]
[null,null,15426]
[null,null,15427]
[null,null,15428]
[null,null,15429]
[null,null,15430]
[null,null,15431]
[null,null,15432]
[null,null,15433]
[null,null,15434]
[null,null,15435]
[null,null,15436]
[null,null,15437]
[null,null,15438]
[null,null,15439]
[null,null,15440]
[null,null,15441]
[null,null,15442]
[null,null,15443]
[null,null,15444]
[null,null,15445]
[null,null,15446]
[null,null,15447]
[null,null,15448]
[null,null,15449]
[null,null,15450]
[null,null,15451]
[null,null,15452]
[null,null,15453]
[null,null,15454]
[null,null,15455]
[null,null,15456]
[null,null,15457]
[null,null,15458]
[null,null,15459]
[null,null,15460]
[null,null,15461]
[null,null,15462]
[null,null,15463]
[null,null,15464]
[null,null,15465]
[null,null,15466]
[null,null,15467]
[null,null,15468]
[null,null,15469]
[null,null,15470]
[null,null,15471]
[null,null,15472]
[null,null,15473]
[null,null,15474]
[null,null,15475]
[null,null,15476]
[null,null,15477]
[null,null,15478]
[null,null,15479]
[null,null,15480]
[null,null,15481]
[null,null,15482]
[null,null,15483]
[null,null,15484]
[null,null,15485]
[null,null,15486]
[null,null,15487]
[null,null,15488]
[null,null,15489]
[null,null,15490]
[null,null,15491]
[null,null,15492]
[null,null,15493]
[null,null,15494]
[null,null,15495]
[null,null,15496]
[null,null,15497]
[null,null,15498]
[null,null,15499]
[null,null,15500]
[null,null,15501]
[null,null,15502]
[null,null,15503]
[null,null,15504]
[null,null,15505]
[null,null,15506]
[null,null,15507]
[null,null,15508]
[null,null,15509]
[null,null,15510]
[null,null,15511]
[null,null,15512]
[null,null,15513]
[null,null,15514]
[null,null,15515]
[null,null,15516]
[null,null,15517]
[null,null,15518]
[null,null,15519]
[null,null,15520]
[null,null,15521]
[null,null,15522]
[null,null,15523]
[null,null,15524]
[null,null,15525]
[null,null,15526]
[null,null,15527]
[null,null,15528]
[null,null,15529]
[null,null,15530]
[null,null,15531]
[null,null,15532]
[null,null,15533]
[null,null,15534]
[null,null,15535]
[null,null,15536]
[null,null,15537]
[null,null,15538]
[null,null,15539]
[null,null,15540]
[null,null,15541]
[null,null,15542]
[null,null,15543]
[null,null,15544]
[null,null,15545]
[null,null,15546]
[null,null,15547]
[null,null,15548]
[null,null,15549]
[null,null,15550]
[null,null,15551]
[null,null,15552]
[null,null,15553]
[null,null,15554]
[null,null,15555]
[null,null,15556]
[null,null,15557]
[null,null,15558]
[null,null,15559]
[null,null,15560]
[null,null,15561]
[null,null,15562]
[null,null,15563]
[null,null,15564]
[null,null,15565]
[null,null,15566]
[null,null,15567]
[null,null,15568]
[null,null,15569]
[null,null,15570]
[null,null,15571]
[null,null,15572]
[null,null,15573]
[null,null,15574]
[null,null,15575]
[null,null,15576]
[null,null,15577]
[null,null,15578]
[null,null,15579]
[null,null,15580]
[null,null,15581]
[null,null,15582]
[null,null,15583]
[null,null,15584]
[null,null,15585]
[null,null,15586]
[null,null,15587]
[null,null,15588]
[null,null,15589]
[null,null,15590]
[null,null,15591]
[null,null,15592]
[null,null,15593]
[null,null,15594]
[null,null,15595]
[null,null,15596]
[null,null,15597]
[null,null,15598]
[null,null,15599]
[null,null,15600]
[null,null,15601]
[null,null,15602]
[null,null,15603]
[null,null,15604]
[null,null,15605]
[null,null,15606]
[null,null,15607]
[null,null,15608]
[null,null,15609]
[null,null,15610]
[null,null,15611]
[null,null,15612]
[null,null,15613]
[null,null,15614]
[null,null,15615]
[null,null,15616]
[null,null,15617]
[null,null,15618]
[null,null,15619]
[null,null,15620]
[null,null,15621]
[null,null,15622]
[null,null,15623]
[null,null,15624]
[null,null,15625]
[null,null,15626]
[null,null,15627]
[null,null,15628]
[null,null,15629]
[null,null,15630]
[null,null,15631]
[null,null,15632]
[null,null,15633]
[null,null,15634]
[null,null,15635]
[null,null,15636]
[null,null,15637]
[null,null,15638]
[null,null,15639]
[null,null,15640]
[null,null,15641]
[null,null,15642]
[null,null,15643]
[null,null,15644]
[null,null,15645]
[null,null,15646]
[null,null,15647]
[null,null,15648]
[null,null,15649]
[null,null,15650]
[null,null,15651]
[null,null,15652]
[null,null,15653]
[null,null,15654]
[null,null,15655]
[null,null,15656]
[null,null,15657]
[null,null,15658]
[null,null,15659]
[null,null,15660]
[null,null,15661]
[null,null,15662]
[null,null,15663]
[null,null,15664]
[null,null,15665]
[null,null,15666]
[null,null,15667]
[null,null,15668]
[null,null,15669]
[null,null,15670]
[null,null,15671]
[null,null,15672]
[null,null,15673]
[null,null,15674]
[null,null,15675]
[null,null,15676]
[null,null,15677]
[null,null,15678]
[null,null,15679]
[null,null,15680]
[null,null,15681]
[null,null,15682]
[null,null,15683]
[null,null,15684]
[null,null,15685]
[null,null,15686]
[null,null,15687]
[null,null,15688]
[null,null,15689]
[null,null,15690]
[null,null,15691]
[null,null,15692]
[null,null,15693]
[null,null,15694]
[null,null,15695]
[null,null,15696]
[null,null,15697]
[null,null,15698]
[null,null,15699]
[null,null,15700]
[null,null,15701]
[null,null,15702]
[null,null,15703]
[null,null,15704]
[null,null,15705]
[null,null,15706]
[null,null,15707]
[null,null,15708]
[null,null,15709]
[null,null,15710]
[null,null,15711]
[null,null,15712]
[null,null,15713]
[null,null,15714]
[null,null,15715]
[null,null,15716]
[null,null,15717]
[null,null,15718]
[null,null,15719]
[null,null,15720]
[null,null,15721]
[null,null,15722]
[null,null,15723]
[null,null,15724]
[null,null,15725]
[null,null,15726]
[null,null,15727]
[null,null,15728]
[null,null,15729]
[null,null,15730]
[null,null,15731]
[null,null,15732]
[null,null,15733]
[null,null,15734]
[null,null,15735]
[null,null,15736]
[null,null,15737]
[null,null,15738]
[null,null,15739]
[null,null,15740]
[null,null,15741]
[null,null,15742]
[null,null,15743]
[null,null,15744]
[null,null,15745]
[null,null,15746]
[null,null,15747]
[null,null,15748]
[null,null,15749]
[null,null,15750]
[null,null,15751]
[null,null,15752]
[null,null,15753]
[null,null,15754]
[null,null,15755]
[null,null,15756]
[null,null,15757]
[null,null,15758]
[null,null,15759]
[null,null,15760]
[null,null,15761]
[null,null,15762]
[null,null,15763]
[null,null,15764]
[null,null,15765]
[null,null,15766]
[null,null,15767]
[null,null,15768]
[null,null,15769]
[null,null,15770]
[null,null,15771]
[null,null,15772]
[null,null,15773]
[null,null,15774]
[null,null,15775]
[null,null,15776]
[null,null,15777]
[null,null,15778]
[null,null,15779]
[null,null,15780]
[null,null,15781]
[null,null,15782]
[null,null,15783]
[null,null,15784]
[null,null,15785]
[null,null,15786]
[null,null,15787]
[null,null,15788]
[null,null,15789]
[null,null,15790]
[null,null,15791]
[null,null,15792]
[null,null,15793]
[null,null,15794]
[null,null,15795]
[null,null,15796]
[null,null,15797]
[null,null,15798]
[null,null,15799]
[null,null,15800]
[null,null,15801]
[null,null,15802]
[null,null,15803]
[null,null,15804]
[null,null,15805]
[null,null,15806]
[null,null,15807]
[null,null,15808]
[null,null,15809]
[null,null,15810]
[null,null,15811]
[null,null,15812]
[null,null,15813]
[null,null,15814]
[null,null,15815]
[null,null,15816]
[null,null,15817]
[null,null,15818]
[null,null,15819]
[null,null,15820]
[null,null,15821]
[null,null,15822]
[null,null,15823]
[null,null,15824]
[null,null,15825]
[null,null,15826]
[null,null,15827]
[null,null,15828]
[null,null,15829]
[null,null,15830]
[null,null,15831]
[null,null,15832]
[null,null,15833]
[null,null,15834]
[null,null,15835]
[null,null,15836]
[null,null,15837]
[null,null,15838]
[null,null,15839]
[null,null,15840]
[null,null,15841]
[null,null,15842]
[null,null,15843]
[null,null,15844]
[null,null,15845]
[null,null,15846]
[null,null,15847]
[null,null,15848]
[null,null,15849]
[null,null,15850]
[null,null,15851]
[null,null,15852]
[null,null,15853]
[null,null,15854]
[null,null,15855]
[null,null,15856]
[null,null,15857]
[null,null,15858]
[null,null,15859]
[null,null,15860]
[null,null,15861]
[null,null,15862]
[null,null,15863]
[null,null,15864]
[null,null,15865]
[null,null,15866]
[null,null,15867]
[null,null,15868]
[null,null,15869]
[null,null,15870]
[null,null,15871]
[null,null,15872]
[null,null,15873]
[null,null,15874]
[null,null,15875]
[null,null,15876]
[null,null,15877]
[null,null,15878]
[null,null,15879]
[null,null,15880]
[null,null,15881]
[null,null,15882]
[null,null,15883]
[null,null,15884]
[null,null,15885]
[null,null,15886]
[null,null,15887]
[null,null,15888]
[null,null,15889]
[null,null,15890]
[null,null,15891]
[null,null,15892]
[null,null,15893]
[null,null,15894]
[null,null,15895]
[null,null,15896]
[null,null,15897]
[null,null,15898]
[null,null,15899]
[null,null,15900]
[null,null,15901]
[null,null,15902]
[null,null,15903]
[null,null,15904]
[null,null,15905]
[null,null,15906]
[null,null,15907]
[null,null,15908]
[null,null,15909]
[null,null,15910]
[null,null,15911]
[null,null,15912]
[null,null,15913]
[null,null,15914]
[null,null,15915]
[null,null,15916]
[null,null,15917]
[null,null,15918]
[null,null,15919]
[null,null,15920]
[null,null,15921]
[null,null,15922]
[null,null,15923]
[null,null,15924]
[null,null,15925]
[null,null,15926]
[null,null,15927]
[null,null,15928]
[null,null,15929]
[null,null,15930]
[null,null,15931]
[null,null,15932]
[null,null,15933]
[null,null,15934]
[null,null,15935]
[null,null,15936]
[null,null,15937]
[null,null,15938]
[null,null,15939]
[null,null,15940]
[null,null,15941]
[null,null,15942]
[null,null,15943]
[null,null,15944]
[null,null,15945]
[null,null,15946]
[null,null,15947]
[null,null,15948]
[null,null,15949]
[null,null,15950]
[null,null,15951]
[null,null,15952]
[null,null,15953]
[null,null,15954]
[null,null,15955]
[null,null,15956]
[null,null,15957]
[null,null,15958]
[null,null,15959]
[null,null,15960]
[null,null,15961]
[null,null,15962]
[null,null,15963]
[null,null,15964]
[null,null,15965]
[null,null,15966]
[null,null,15967]
[null,null,15968]
[null,null,15969]
[null,null,15970]
[null,null,15971]
[null,null,15972]
[null,null,15973]
[null,null,15974]
[null,null,15975]
[null,null,15976]
[null,null,15977]
[null,null,15978]
[null,null,15979]
[null,null,15980]
[null,null,15981]
[null,null,15982]
[null,null,15983]
[null,null,15984]
[null,null,15985]
[null,null,15986]
[null,null,15987]
[null,null,15988]
[null,null,15989]
[null,null,15990]
[null,null,15991]
[null,null,15992]
[null,null,15993]
[null,null,15994]
[null,null,15995]
[null,null,15996]
[null,null,15997]
[null,null,15998]
[null,null,15999]
[null,null,16000]
[null,null,16001]
[null,null,16002]
[null,null,16003]
[null,null,16004]
[null,null,16005]
[null,null,16006]
[null,null,16007]
[null,null,16008]
[null,null,16009]
[null,null,16010]
[null,null,16011]
[null,null,16012]
[null,null,16013]
[null,null,16014]
[null,null,16015]
[null,null,16016]
[null,null,16017]
[null,null,16018]
[null,null,16019]
[null,null,16020]
[null,null,16021]
[null,null,16022]
[null,null,16023]
[null,null,16024]
[null,null,16025]
[null,null,16026]
[null,null,16027]
[null,null,16028]
[null,null,16029]
[null,null,16030]
[null,null,16031]
[null,null,16032]
[null,null,16033]
[null,null,16034]
[null,null,16035]
[null,null,16036]
[null,null,16037]
[null,null,16038]
[null,null,16039]
[null,null,16040]
[null,null,16041]
[null,null,16042]
[null,null,16043]
[null,null,16044]
[null,null,16045]
[null,null,16046]
[null,null,16047]
[null,null,16048]
[null,null,16049]
[null,null,16050]
[null,null,16051]
[null,null,16052]
[null,null,16053]
[null,null,16054]
[null,null,16055]
[null,null,16056]
[null,null,16057]
[null,null,16058]
[null,null,16059]
[null,null,16060]
[null,null,16061]
[null,null,16062]
[null,null,16063]
[null,null,16064]
[null,null,16065]
[null,null,16066]
[null,null,16067]
[null,null,16068]
[null,null,16069]
[null,null,16070]
[null,null,16071]
[null,null,16072]
[null,null,16073]
[null,null,16074]
[null,null,16075]
[null,null,16076]
[null,null,16077]
[null,null,16078]
[null,null,16079]
[null,null,16080]
[null,null,16081]
[null,null,16082]
[null,null,16083]
[null,null,16084]
[null,null,16085]
[null,null,16086]
[null,null,16087]
[null,null,16088]
[null,null,16089]
[null,null,16090]
[null,null,16091]
[null,null,16092]
[null,null,16093]
[null,null,16094]
[null,null,16095]
[null,null,16096]
[null,null,16097]
[null,null,16098]
[null,null,16099]
[null,null,16100]
[null,null,16101]
[null,null,16102]
[null,null,16103]
[null,null,16104]

{"sheet":"IMPORTFORM","index":1,"n_rows":16,"n_cols":10,"rows_kept":16,"cut":false,"hidden":false,"merged":[[6,0,8,0],[6,1,8,1]]}
[]
[]
["WEBSITE","IMPORT METHOD"]
["http://pubs.acs.org/journal/jacsat","DIRECT COPY"]
["http://www.sciencedirect.com/","BIBTEX; COPY JOURNAL TO AUTHOR"]
["http://onlinelibrary.wiley.com","BIBTEX; COPY ALL"]
["http://www.springerlink.com/","COPY JOURNAL AND DETAILS, STORE, COPY AUTHORS, STORE, CLICK YEAR + IMPORT"]
[]
[]
["http://pubs.rsc.org/","COPY AUTHORS, JOURNAL DETAILS AND DOI, UP TO (BUT NOT INCLUDING) THE COMMA"]
[]
[null,null,null,null,null,null,null,null,"Type to Edit"]
[null,null,null,null,null,null,"LAST IMPORT ID",null,"FONT STYLE","FONT SIZE"]
["IMPERIAL REFERENCE STYLE",null,null,"STORING IMPORTED REFERENCES ON?","YES",null,0,null,"TIMES",10]
[]
["Wiki <ref> code"]

{"sheet":"INSTRUCTIONS","index":2,"n_rows":62,"n_cols":7,"rows_kept":62,"cut":false,"hidden":true,"merged":[]}
[]
[]
[]
[null,"What does this program do?",null,null,"The program takes the information imported into it (about the authors, journals, etc ) and orders and formats it into the \"Imperial\" Referencing Style and a wiki ref output."]
[null,"Why all the buttons?",null,null,"Because each website provides the required information in a different way, a different model is used to format data from each website."]
[null,"What can it Import?",null,null,"The program can only format/extract based on what it expects. Therefore, it only works if the instructions are clearly followed"]
[null,null,null,null,"The program does not think. It has a few safety catches, but can easily be fooled by poor inputs. For example, copying a picture and pressing import is not a good idea..."]
[null,null,null,null,"The program cannot currently import anything except journals from the given websites. It is not an all inclusive referencing package."]
[null,"It's Not Working!",null,null,"If an import does not import/format the information properly, you can report the error (by leaving the DOI) on the Imperial Wiki page for this program and I may fix it."]
[null,null,null,null,"Of course, you might not be following the instructions. Then it's probably your fault."]
[]
[null,"The Clear Clipboard Button:",null,null,"Excel is odd. If something has been copied in excel and not cleared, it overrides other copied data and decides to paste its own clipboard."]
[null,null,null,null,"Press Clear Clipboard after copying formatted data, before importing a new reference."]
[null,null,null,null,"Those flashing lines around the cell will disappear and you might actually get an import to work."]
[]
[null,"RESET  - PRESS IF ERROR OCCURS:  Button",null,null,null,null,"Sometimes the wrong thing is pasted. Sometimes this tricks the program into doing bad things. Press reset if things look bad and it may fix something,"]
[null,null,null,null,null,null,"It might not. (Pressing this button will not clear the RefStore)"]
[]
[null,"User Specified Fonts etc",null,null,"You can set your own font style and size via the excel menus"]
[]
[null,null,null,null,null,"A full set of instructions for importing with diagrams is available on the designated Wiki page."]
[null,"TO IMPORT FROM:",null,null,null,"https://wiki.ch.ic.ac.uk/wiki/index.php?title=Mod:Reference_Formatting_Program"]
[null,"PUBS.ACS","American Chemical Society"]
[1,"ON THE PUBS JOURNAL ABSTRACT PAGE, ON THE LEFT OF THE SCREEN, HIGHLIGHT FROM THE START OF THE AUTHOR TO THE END OF THE DOI ONLY AND COPY"]
[2,"IN EXCEL, PRESS IMPORT PUBS"]
[]
[]
[null,"SCIENCE DIRECT"]
[1,"ON THE SCIENCE DIRECT JOURNAL ABSTRACT PAGE, NAVIGATE TO EXPORT CITATION AND CHOOSE THE BIBTEXT OPTION"]
[2,"OPEN THE DOWNLOADED FILE IN NOTEPAD/TEXTEDIT"]
[3,"COPY FROM THE START OF THE JOURNAL LINE TO THE END OF THE AUTHORS ONLY (IMPORTANT)"]
[4,"PRESS IMPORT SCIENCE DIRECT"]
[]
[]
[null,"WILEY"]
[1,"ON THE JOURNAL ABSTRACT PAGE, CLICK ON \"EXPORT CITATION FOR THIS EXTRACT\""]
[2,"CHOOSE BIBTEXT - PLAIN TEXT FORMAT AND OPEN RESULTING FILE IN NOTEPAD/TEXTEDIT"]
[3,"COPY ALL TEXT"]
[4,"IN EXCEL, PRESS IMPORT WILEY"]
[]
[]
[null,"SPRINGERLINK"]
[1,"ON THE JOURNAL ABSTRACT PAGE COPY THE TWO LINES AT THE TOP, THE JOURNAL ON THE TOP LINE AND THE JOURNAL DETAILS ON THE SECOND (STARTING WITH VOLUME)"]
[2,"IN EXCEL, PRESS \"STORE JOURNAL\" FOR THE SPRINGERLINK IMPORT"]
[3,"RETURNING TO THE ABSTRACT PAGE, COPY THE AUTHORS"]
[4,"IN EXCEL, PRESS \"STORE AUTHORS\" FOR THE SPRINGERLINK IMPORT"]
[5,"CLICK YEAR AND IMPORT, TYPE OR PASTE THE DATE OF THE PUBLICATION AND PROCEED"]
[]
[null,"(IT IS IMPORTANT THE DATA IS IMPORTED IN THIS ORDER!)"]
[null,"(EACH BUTTON TURNS GREEN IF THE PROGRAM THINKS YOU'VE IMPORTED THE CORRECT NUMBER OF LINES)"]
[null,"(IF AN IMPORT ERROR OCCURS, CAREFULLY COPY THE CORRECT DATA AGAIN AND PRESS THE RELEVANT STORE BUTTON)"]
[]
[]
[null,"RSC"]
[1,"ON THE RSC JOURNAL ABSTRACT PAGE, COPY FROM THE START OF THE AUTHOR LINE, DOWN TO THE END OF THE DOI, UP TO, BUT NOT INCLUDING THE FINAL COMMA"]
[2,"DO NOT INCLUDE THE FINAL \"JOURNAL/REVIEW/COMMUNICATION\" PART OF THIS LINE"]
[3,"IN EXCEL, PRESS THE \"IMPORT RSC\" BUTTON"]
[]
[null,"NOTE THAT FOR SOME JOURNALS ON THIS WEBSITE, SUCH AS THE DALTON TRANS, NO VOLUME IS INCLUDING IN THE COPIED TEXT."]
[null,"IF THE PROGRAM THINKS THIS INFORMATION IS MISSING, IT WILL PROMPT YOU TO ENTER THE MISSING ISSUE NUMBER."]
[null,"THIS IS EASILY FOUND ON THE JOURNAL ABSTRACT PAGE, NEXT TO THE LARGE JOURNAL NAME HEADING AT THE TOP, WHERE IT WILL SAY \"ISSUE#, YEAR\""]
[null,"(DO NOT INCLUDE THE YEAR WHEN YOU TYPE, ONLY THE ISSUE NUMBER!)"]

{"sheet":"Abbrev","index":3,"n_rows":8,"n_cols":3,"rows_kept":8,"cut":false,"hidden":true,"merged":[]}
[]
[null,"COMING SOON"]
["ID","JOURNAL","Abbrev."]
[null,"Chemical Physics Letters","Chem. Phys. Lett."]
[null,"Journal of Trace Elements in Medicine and Biology","J. of Trace Elements in Med. And Bio."]
[null,"Tetrahedron Letters","Tet. Lett."]
[null,"Journal of Solid State Chemistry","J. Solid State Chem."]
[null,"Nuclear Instruments and Methods in Physics Research Section A: Accelerators, Spectrometers, Detectors and Associated Equipment","Nuc. Instr. And Methods"]

{"sheet":"J. Am. Chem. Soc.","index":4,"n_rows":29,"n_cols":103,"rows_kept":29,"cut":false,"hidden":true,"merged":[]}
[]
[null,null,null,null,null,null,null,"ID","DATE","AUTHOR","JOURNAL","YEAR","VOLUME (No)","DOI","PAGE","IMPORT","WIKI","FORMATTED"]
[null,null,null,null,null,null,"EXPORT",null,{"$f":"TODAY()","v":"2011-03-18"},{"$f":"B4","v":0},{"$f":"B10","v":"*"},{"$f":"C10","v":"*"},{"$f":"D10","v":"*"},{"$f":"B6","v":0},{"$f":"F10","v":"*"},"JACS",{"$f":"B29","v":"<ref name=\"NAMEHERE\">''*'',*,'''*''', * {{DOI|*}}</ref>"},"*. *. *. *. *. *. *. *. *. *. *. *. *. *. *. *. *. *. *. *. *. *. *. *. *. *. *. *. *. *. *. *. *. *. *. *. *. *. *. *. *. *. *. *. *. *. *. *. *. *. *. *. *. *. *. *. *. *. *. *. *. *. *. *. *. *. *. *. *. *. *. *. *. *. *. *. *. *. *. *. *. *. *. *. *. *. *. *. *. *. *. *. *. *. *. *. *. *. *. *. *. *. *,*,*, *"]
["AUTHORS",null,null,null,null,null,"RE-EXPORT",{"$f":"REFSTORE!G2","v":0},{"$f":"VLOOKUP('J. Am. Chem. Soc.'!$H$4,REFSTORE!$C$6:$K$50000,2)","v":{"$error":"#N/A"}},{"$f":"VLOOKUP('J. Am. Chem. Soc.'!$H$4,REFSTORE!$C$6:$K$50000,3)","v":{"$error":"#N/A"}},{"$f":"VLOOKUP('J. Am. Chem. Soc.'!$H$4,REFSTORE!$C$6:$K$50000,4)","v":{"$error":"#N/A"}},{"$f":"VLOOKUP('J. Am. Chem. Soc.'!$H$4,REFSTORE!$C$6:$K$50000,5)","v":{"$error":"#N/A"}},{"$f":"VLOOKUP('J. Am. Chem. Soc.'!$H$4,REFSTORE!$C$6:$K$50000,6)","v":{"$error":"#N/A"}},{"$f":"VLOOKUP('J. Am. Chem. Soc.'!$H$4,REFSTORE!$C$6:$K$50000,7)","v":{"$error":"#N/A"}},{"$f":"VLOOKUP('J. Am. Chem. Soc.'!$H$4,REFSTORE!$C$6:$K$50000,8)","v":{"$error":"#N/A"}},{"$f":"VLOOKUP('J. Am. Chem. Soc.'!$H$4,REFSTORE!$C$6:$K$50000,9)","v":{"$error":"#N/A"}},"CONC",{"$f":"J4&\", \"&K4&\", \"&L4&\", \"&M4&\", \"&O4","v":{"$error":"#N/A"}}]
["JOURNAL",null,null,null,null,null,null,null,null,null,null,null,null,null,null,null,"WIKI",{"$f":"\"<ref name=\"\"NAMEHERE\"\">\"&J4&\", ''\"&K4&\"'', \"&L4&\", '''\"&M4&\"''', \"&O4&\" {{DOI|\"&N4&\"}}</ref>\"","v":{"$error":"#N/A"}}]
["CHECK DOI"]
[{"$f":"IF(myextract(B7,1,\"F\",\" \")=\"DOI:\",\"NOT OK\",\"OK\")","v":"OK"}]
[{"$f":"IF(myextract(B8,1,\"F\",\" \")=\"DOI:\",\"NOT OK\",\"OK\")","v":"OK"}]
[{"$f":"IF(myextract(B9,1,\"F\",\" \")=\"DOI:\",\"NOT OK\",\"OK\")","v":"OK"},null,"Year","Vol (no)","p/pp page","page","together",null,null,null,"DOI:"]
["Journal",{"$f":"myextract($B$5,1,\"F\",\",\")","v":"*"},{"$f":"myextract($B$5,2,\"F\",\",\")","v":"*"},{"$f":"myextract($B$5,3,\"F\",\",\")","v":"*"},{"$f":"((myextract($B$5,4,\"F\",\",\")))","v":"*"},{"$f":"IF(E11=\"pp\",(myextract(E10,2,\"F\",\"–\")),myextract(E10,1,\"B\",\" \"))","v":"*"},{"$f":"B10&\",\"&C10&\",\"&D10&\", \"&F10","v":"*,*,*, *"},null,null,null,{"$f":"myextract(B6,2,\"F\",\" \")","v":"*"}]
["len journal",{"$f":"LEN(B10)","v":1},null,"p or pp?",{"$f":"MID(myextract(E10,1,\"F\",\" \"),2,4)","v":""}]
[]
[]
["Authors",{"$f":"B4","v":0}]
["plus comma",{"$f":"B14&\",\"","v":"0,"},{"$f":"LEN(B10)+LEN(C10)","v":2}]
["Len string",{"$f":"LEN(B15)","v":2}]
["Count Term",1,2,3,4,5,6,7,8,9,10,11,12,13,14,15,16,17,18,19,20,21,22,23,24,25,26,27,28,29,30,31,32,33,34,35,36,37,38,39,40,41,42,43,44,45,46,47,48,49,50,51,52,53,54,55,56,57,58,59,60,61,62,63,64,65,66,67,68,69,70,71,72,73,74,75,76,77,78,79,80,81,82,83,84,85,86,87,88,89,90,91,92,93,94,95,96,97,98,99,100,101,102]
["Split Words",{"$f":"myextract($B$15,B17,\"F\",\" \")","v":"*"},{"$f":"myextract($B$15,C17,\"F\",\" \")","v":"*"},"*","*","*","*","*","*","*","*","*","*","*","*","*","*","*","*","*","*","*","*","*","*","*","*","*","*","*","*","*","*",{"$f":"myextract($B$15,AH17,\"F\",\" \")","v":"*"},"*","*","*","*","*","*","*","*","*","*","*","*","*","*","*","*","*","*","*","*","*","*","*","*","*","*","*","*","*","*","*",{"$f":"myextract($B$15,BN17,\"F\",\" \")","v":"*"},"*","*","*","*","*","*","*","*","*","*","*","*","*","*","*","*","*","*","*","*","*","*","*","*","*","*","*","*","*","*","*",{"$f":"myextract($B$15,CT17,\"F\",\" \")","v":"*"},"*","*","*","*","*"]
["Initialise",{"$f":"IF(RIGHT(B18,1)=\",\",B18,(LEFT(B18,1))&\".\")","v":"*."},{"$f":"IF(RIGHT(C18,1)=\",\",C18,(LEFT(C18,1))&\".\")","v":"*."},"*.","*.","*.","*.","*.","*.","*.","*.","*.","*.","*.","*.","*.","*.","*.","*.",{"$f":"IF(RIGHT(T18,1)=\",\",T18,(LEFT(T18,1))&\".\")","v":"*."},"*.","*.","*.","*.","*.","*.","*.","*.","*.","*.","*.","*.","*.","*.","*.","*.","*.","*.","*.","*.","*.","*.","*.","*.","*.","*.","*.","*.","*.","*.","*.",{"$f":"IF(RIGHT(AZ18,1)=\",\",AZ18,(LEFT(AZ18,1))&\".\")","v":"*."},"*.","*.","*.","*.","*.","*.","*.","*.","*.","*.","*.","*.","*.","*.","*.","*.","*.","*.","*.","*.","*.","*.","*.","*.","*.","*.","*.","*.","*.","*.","*.",{"$f":"IF(RIGHT(CF18,1)=\",\",CF18,(LEFT(CF18,1))&\".\")","v":"*."},"*.","*.","*.","*.","*.","*.","*.","*.","*.","*.","*.","*.","*.","*.","*.","*.","*.","*.","*."]
["Len",{"$f":"LEN(B19)","v":2},{"$f":"LEN(C19)","v":2},2,2,2,2,2,2,2,2,2,2,2,2,2,2,2,2,{"$f":"LEN(T19)","v":2},2,2,2,2,2,2,2,2,2,2,2,2,2,2,2,2,2,2,2,2,2,2,2,2,2,2,2,2,2,2,2,{"$f":"LEN(AZ19)","v":2},2,2,2,2,2,2,2,2,2,2,2,2,2,2,2,2,2,2,2,2,2,2,2,2,2,2,2,2,2,2,2,{"$f":"LEN(CF19)","v":2},2,2,2,2,2,2,2,2,2,2,2,2,2,2,2,2,2,2,2]
["Active?",{"$f":"IF(B20=0,\"\",IF(B20=$B$16,\"\",B19&\" \"))","v":""},{"$f":"IF(C20=0,\"\",IF(C20=$B$16,\"\",C19&\" \"))","v":""},"","","","","","","","","","","","","","","","","","","","","","","","","","","","","","","","","","","","","","","","","","","","","","","","","","","","","","","","","","","","","","","",{"$f":"IF(BO20=0,\"\",IF(BO20=$B$16,\"\",BO19&\" \"))","v":""},"","","","","","","","","","","","","","","","","","","","","","","","","","","","","","","","","","","",""]
["len authors+1",{"$f":"LEN(B23)+1","v":1},"Total",{"$f":"B22+C15+2","v":5}]
["Com Name",{"$f":"CONCATENATE(B21,C23)","v":""},{"$f":"CONCATENATE(C21,D23)","v":""},"","","","","","","","","","","","","",{"$f":"CONCATENATE(Q21,R23)","v":""},"","","","","","","","","","","","","","","","","","","","","","","","","","","","","","","",{"$f":"CONCATENATE(AW21,AX23)","v":""},"","","","","","","","","","","","","","","","","","","","","","","","","","","","","","","",{"$f":"CONCATENATE(CC21,CD23)","v":""},"","","","","","","","","","","","","","","","","","","","","",""]
["Plus Journal",{"$f":"B23&G10","v":"*,*,*, *"}]
["Format"]
[]
[]
[]
["Wiki",{"$f":"\"<ref name=\"\"NAMEHERE\"\">\"&B23&\"''\"&B10&\"'',\"&C10&\",'''\"&D10&\"''', \"&F10&\" {{DOI|\"&K10&\"}}</ref>\"","v":"<ref name=\"NAMEHERE\">''*'',*,'''*''', * {{DOI|*}}</ref>"}]

{"sheet":"ScienceDirect","index":5,"n_rows":78,"n_cols":140,"rows_kept":78,"cut":false,"hidden":true,"merged":[]}
["CHECK"]
["(1 FOR WRONG)",null,null,"Check","Check"]
[{"$f":"SUM(A4:A22)","v":10},"IMPORT","<ref name=\"Advances In Platinum Chemotherapeutics\">B. Harper, A. Krause-Heuer, M. Grant, M. Manohar, K. B. Garbutcheon-Singh, J. Aldrich-Wright, ''Chemistry – A European Journal'', 2010, '''16 (24)''', 7064 {{DOI|10.1002/chem.201000148}}</ref>",{"$f":"SUM(D4:D13)","v":{"$error":"#VALUE!"}},{"$f":"SUM(E4:E13)","v":{"$error":"#VALUE!"}}]
[{"$f":"IF(myextract(B4,1,\"F\",\" \")=\"journal\",0,1)","v":1},null,null,{"$f":"IF(myextract(C3,1,\"F\",\" \")=\"journal\",0,1)","v":1},{"$f":"IF(myextract(D4,1,\"F\",\" \")=\"journal\",0,1)","v":1},null,null,"ID","DATE","AUTHOR","JOURNAL","YEAR","VOLUME (No)","DOI","PAGE","IMPORT","WIKI"]
[null,null,null,{"$f":"IF(myextract(#REF!,1,\"F\",\" \")=\"VOLUME\",0,1)","v":{"$error":"#VALUE!"}},{"$f":"IF(myextract(D5,1,\"F\",\" \")=\"VOLUME\",0,1)","v":{"$error":"#VALUE!"}},null,null,null,{"$f":"TODAY()","v":"2011-03-18"},{"$f":"L53","v":""},{"$f":"L28","v":"*"},{"$f":"L36","v":"*"},{"$f":"N32","v":"* (*)"},{"$f":"L42","v":"*"},{"$f":"M34","v":"*"},"SD",{"$f":"L60","v":"<ref name=\"NAMEHERE\">, ''*'', *, '''* (*)''', * {{DOI|*}}</ref>"},"X. Liu, K. Surowiec, R. A. Bartsch, Tetrahedron, 2009, 65 (31), 5893"]
[{"$f":"IF(myextract(B6,1,\"F\",\" \")=\"VOLUME\",0,1)","v":1},null,null,{"$f":"IF(myextract(#REF!,1,\"F\",\" \")=\"NUMBER\",0,1)","v":{"$error":"#VALUE!"}},{"$f":"IF(myextract(D6,1,\"F\",\" \")=\"NUMBER\",0,1)","v":{"$error":"#VALUE!"}},null,null,"RE-EXPORT",{"$f":"REFSTORE!G2","v":0},{"$f":"VLOOKUP('J. Am. Chem. Soc.'!$H$4,REFSTORE!$C$6:$K$50000,2)","v":{"$error":"#N/A"}},{"$f":"VLOOKUP('J. Am. Chem. Soc.'!$H$4,REFSTORE!$C$6:$K$50000,3)","v":{"$error":"#N/A"}},{"$f":"VLOOKUP('J. Am. Chem. Soc.'!$H$4,REFSTORE!$C$6:$K$50000,4)","v":{"$error":"#N/A"}},{"$f":"VLOOKUP('J. Am. Chem. Soc.'!$H$4,REFSTORE!$C$6:$K$50000,5)","v":{"$error":"#N/A"}},{"$f":"VLOOKUP('J. Am. Chem. Soc.'!$H$4,REFSTORE!$C$6:$K$50000,6)","v":{"$error":"#N/A"}},{"$f":"VLOOKUP('J. Am. Chem. Soc.'!$H$4,REFSTORE!$C$6:$K$50000,7)","v":{"$error":"#N/A"}},{"$f":"VLOOKUP('J. Am. Chem. Soc.'!$H$4,REFSTORE!$C$6:$K$50000,8)","v":{"$error":"#N/A"}},{"$f":"VLOOKUP('J. Am. Chem. Soc.'!$H$4,REFSTORE!$C$6:$K$50000,9)","v":{"$error":"#N/A"}},"CONC",{"$f":"K6&\", \"&L6&\", \"&M6&\", \"&N6&\", \"&P6","v":{"$error":"#N/A"}}]
[null,null,null,{"$f":"IF(myextract(C7,1,\"F\",\" \")=\"PAGES\",0,1)","v":1},{"$f":"IF(myextract(D7,1,\"F\",\" \")=\"PAGES\",0,1)","v":1},null,null,null,null,null,null,null,null,null,null,null,null,"WIKI",{"$f":"\"<ref name=\"\"NAMEHERE\"\">\"&K6&\", ''\"&L6&\"'', \"&M6&\", '''\"&N6&\"''', \"&P6&\" {{DOI|\"&O6&\"}}</ref>\"","v":{"$error":"#N/A"}}]
[{"$f":"IF(myextract(B8,1,\"F\",\" \")=\"NUMBER\",0,1)","v":1},null,null,{"$f":"IF(myextract(C8,1,\"F\",\" \")=\"YEAR\",0,1)","v":1},{"$f":"IF(myextract(D8,1,\"F\",\" \")=\"YEAR\",0,1)","v":1}]
[null,null,null,{"$f":"IF(myextract(C9,1,\"F\",\" \")=\"NOTE\",0,1)","v":1},{"$f":"IF(myextract(D9,1,\"F\",\" \")=\"NOTE\",0,1)","v":1}]
[{"$f":"IF(myextract(B10,1,\"F\",\" \")=\"PAGES\",0,1)","v":1},null,null,{"$f":"IF(myextract(C10,1,\"F\",\" \")=\"ISSN\",0,1)","v":1},{"$f":"IF(myextract(D10,1,\"F\",\" \")=\"ISSN\",0,1)","v":1}]
[null,null,null,{"$f":"IF(myextract(C11,1,\"F\",\" \")=\"DOI\",0,1)","v":1},{"$f":"IF(myextract(D11,1,\"F\",\" \")=\"DOI\",0,1)","v":1}]
[{"$f":"IF(myextract(B12,1,\"F\",\" \")=\"YEAR\",0,1)","v":1},null,null,{"$f":"IF(myextract(C12,1,\"F\",\" \")=\"URL\",0,1)","v":1},{"$f":"IF(myextract(D12,1,\"F\",\" \")=\"URL\",0,1)","v":1}]
[null,null,null,{"$f":"IF(myextract(C13,1,\"F\",\" \")=\"AUTHOR\",0,1)","v":1},{"$f":"IF(myextract(D13,1,\"F\",\" \")=\"AUTHOR\",0,1)","v":1}]
[{"$f":"IF(myextract(B14,1,\"F\",\" \")=\"NOTE\",0,1)","v":1}]
[]
[{"$f":"IF(myextract(B16,1,\"F\",\" \")=\"ISSN\",0,1)","v":1}]
[]
[{"$f":"IF(myextract(B18,1,\"F\",\" \")=\"DOI\",0,1)","v":1}]
[]
[{"$f":"IF(myextract(B20,1,\"F\",\" \")=\"URL\",0,1)","v":1}]
[]
[{"$f":"IF(myextract(B22,1,\"F\",\" \")=\"AUTHOR\",0,1)","v":1}]
[]
[]
[]
[]
[]
[{"$f":"myextract(B28,1,\"F\",\" \")","v":"*"},null,null,null,null,null,null,null,null,null,"Journal",{"$f":"myextract(B28,2,\"F\",\"\"\"\")","v":"*"}]
[null,null,null,null,null,null,null,null,null,null,"Len",{"$f":"LEN(L28)","v":1}]
[null,null,null,null,null,null,null,null,null,null,"Vol",{"$f":"myextract(B29,2,\"F\",\"\"\"\")","v":"*"}]
[]
[null,null,null,null,null,null,null,null,null,null,"vol No",{"$f":"myextract(B30,2,\"F\",\"\"\"\")","v":"*"},null,{"$f":"L30&\" (\"&L32&\")\"","v":"* (*)"}]
[]
[null,null,null,null,null,null,null,null,null,null,"Pages",{"$f":"myextract(B31,2,\"F\",\"\"\"\")","v":"*"},{"$f":"myextract(L34,1,\"F\",\" \")","v":"*"}]
[]
[null,null,null,null,null,null,null,null,null,null,"Year",{"$f":"myextract(B32,2,\"F\",\"\"\"\")","v":"*"}]
[]
[null,null,null,null,null,null,null,null,null,null,"Full Journal",{"$f":"L28&\", \"&L36&\", \"&L30&\" (\"&L32&\"), \"&M34","v":"*, *, * (*), *"}]
[]
[]
[]
[null,null,null,null,null,null,null,null,null,null,"DOI:",{"$f":"myextract(myextract(B35,2,\"F\",\"\"\"\"),2,\"F\",\" \")","v":"*"}]
[]
[null,null,null,null,null,null,null,null,null,null,null,"Author(s)"]
[null,null,null,null,null,null,null,null,null,null,"`",{"$f":"myextract(B37,2,\"F\",\"\"\"\")","v":"*"}]
[null,null,null,null,null,null,null,null,null,null,null,"*"]
[null,null,null,null,null,null,null,null,null,"LEN","Counter",1,2,3,4,5,6,7,8,9,10,11,12,13,14,15,16,17,18,19,20,21,22,23,24,25,26,27,28,29,30,31,32,33,34,35,36,37,38,39,40,41,42,43,44,45,46,47,48,49,50,51,52,53,54,55,56,57,58,59,60,61,62,63,64,65,66,67,68,69,70,71,72,73,74,75,76,77,78,79,80,81,82,83,84,85,86,87,88,89,90,91,92,93,94,95,96,97,98,99,100,101,102,103,104,105,106,107,108,109,110,111,112,113,114,115,116,117,118,119,120,121,122,123,124,125,126,127,128,129]
[null,null,null,null,null,null,null,null,null,{"$f":"LEN(L46)","v":1},null,{"$f":"myextract($L$46,L47,\"F\",\" \")","v":"*"},{"$f":"myextract($L$46,M47,\"F\",\" \")","v":"*"},"*","*","*","*","*",{"$f":"myextract($L$46,S47,\"F\",\" \")","v":"*"},"*","*","*","*","*","*","*","*","*","*","*","*","*","*","*","*","*","*","*","*","*","*","*","*","*","*","*","*","*","*","*",{"$f":"myextract($L$46,AY47,\"F\",\" \")","v":"*"},"*","*","*","*","*","*","*","*","*","*","*","*","*","*","*","*","*","*","*","*","*","*","*","*","*","*","*","*","*","*","*",{"$f":"myextract($L$46,CE47,\"F\",\" \")","v":"*"},"*","*","*","*","*","*","*","*","*","*","*","*","*","*","*","*","*","*","*","*","*","*","*","*","*","*","*","*","*","*","*",{"$f":"myextract($L$46,DK47,\"F\",\" \")","v":"*"},"*","*","*","*","*","*","*","*","*","*","*","*","*","*","*","*","*","*","*","*","*","*","*","*","*"]
[null,null,null,null,null,null,null,null,null,null,"INITIALISE",{"$f":"IF(L48=\"and\",\"\",IF(M48=\"and\",L48&\", \",IF(M50=$J$48,L48,(LEFT(L48,1)&\". \"))))","v":"*"},{"$f":"IF(M48=\"and\",\"\",IF(N48=\"and\",M48&\", \",IF(N50=$J$48,M48,(LEFT(M48,1)&\". \"))))","v":"*"},"*","*","*","*","*","*","*","*","*","*","*","*","*","*","*","*","*","*","*","*","*","*","*","*","*","*","*","*","*","*","*","*","*","*","*","*","*","*","*","*","*","*","*","*","*","*","*","*","*","*","*","*","*","*","*","*","*","*","*","*","*","*","*",{"$f":"IF(BY48=\"and\",\"\",IF(BZ48=\"and\",BY48&\", \",IF(BZ50=$J$48,BY48,(LEFT(BY48,1)&\". \"))))","v":"*"},"*","*","*","*","*","*","*","*","*","*","*","*","*","*","*","*","*","*","*","*","*","*","*","*","*","*","*","*","*","*","*","*","*","*","*","*","*","*","*","*","*","*","*","*","*","*","*","*","*","*","*","*","*","*","*","*","*","*","*","*","*","*","*. "]
[null,null,null,null,null,null,null,null,null,null,"LEN",{"$f":"LEN(L48)","v":1},{"$f":"LEN(M48)","v":1},1,1,1,1,1,1,1,1,1,1,1,1,1,1,1,1,1,1,1,1,1,1,1,1,1,1,1,1,1,1,1,1,1,1,1,1,1,1,1,1,1,1,1,1,1,1,1,1,1,1,1,1,1,1,1,1,1,1,1,1,1,1,1,{"$f":"LEN(BY48)","v":1},1,1,1,1,1,1,1,1,1,1,1,1,1,1,1,1,1,1,1,1,1,1,1,1,1,1,1,1,1,1,1,1,1,1,1,1,1,1,1,1,1,1,1,1,1,1,1,1,1,1,1,1,1,1,1,1,1,1,1,1,1,1,1]
[null,null,null,null,null,null,null,null,null,null,"Active?",{"$f":"IF(L50=$J$48,\"\",L49)","v":""},{"$f":"IF(M50=$J$48,\"\",M49)","v":""},"","","","","","","","","","","","","","","","","","","","","","","","","","","","","","","","","","","","","","","","","","","","","","","","","","","","","","","","","","","","","","","",{"$f":"IF(BY50=$J$48,\"\",BY49)","v":""},"","","","","","","","","","","","","","","","","","","","","","","","","","","","","","","","","","","","","","","","","","","","","","","","","","","","","","","","","","","","","","",""]
[]
[null,null,null,null,null,null,null,null,null,null,"Com Name",{"$f":"CONCATENATE(L51,M53)","v":""},{"$f":"CONCATENATE(M51,N53)","v":""},"","","","","","","","","","","","","","","","","","","","","","","","","","","","","","","","","","","","","","","","","","","","","","","","","","","","","","","","","","","","","","","",{"$f":"CONCATENATE(BY51,BZ53)","v":""},"","","","","","","","","","","","","","","","","","","","","","","","","","","","","","","","","","","","",{"$f":"CONCATENATE(DJ51,DK53)","v":""},"","","","","","","","","","","","","","","","","","","","","","","","",""]
[null,null,null,null,null,null,null,null,null,null,"Real Len",{"$f":"LEN(L53)+3","v":3},"Names + journal Len",null,{"$f":"L54+L29+2+6","v":12}]
[null,null,null,null,null,null,null,null,null,null,"Plus Journal",{"$f":"L53&\", \"&L38","v":", *, *, * (*), *"}]
[null,null,null,null,null,null,null,null,null,null,"Format",", *, *, * (*), *"]
[]
[]
[]
[null,null,null,null,null,null,null,null,null,null,"Wiki",{"$f":"\"<ref name=\"\"NAMEHERE\"\">\"&L53&\", ''\"&L28&\"'', \"&L36&\", '''\"&L30&\" (\"&L32&\")''', \"&M34&\" {{DOI|\"&L42&\"}}</ref>\"","v":"<ref name=\"NAMEHERE\">, ''*'', *, '''* (*)''', * {{DOI|*}}</ref>"}]
[]
[]
[]
[]
[]
[]
[]
[null,null,null,null,null,null,null,null,null,null,"Characters","Replacement"]
[null,null,null,null,null,null,null,null,null,null,"·","á"]
[null,null,null,null,null,null,null,null,null,null,"È","é"]
[null,null,null,null,null,null,null,null,null,null,"ˆ","ö"]
[null,null,null,null,null,null,null,null,null,null,"‰","ä"]
[null,null,null,null,null,null,null,null,null,null,"\""]
[null,null,null,null,null,null,null,null,null,null,"¸","ü"]
[null,null,null,null,null,null,null,null,null,null,"ﬂ","ß"]
[null,null,null,null,null,null,null,null,null,null,"Á","ç"]
[null,null,null,null,null,null,null,null,null,null,"Â","å"]
[null,null,null,null,null,null,null,null,null,null,"ÿ","Ø"]

{"sheet":"Wiley","index":6,"n_rows":45,"n_cols":138,"rows_kept":45,"cut":false,"hidden":true,"merged":[]}
[]
["ID","DATE","AUTHOR","JOURNAL","YEAR","VOLUME (No)","DOI","PAGE","IMPORT","wiki"]
[null,{"$f":"TODAY()","v":"2011-03-18"},{"$f":"J38","v":"B. Harper, A. Krause-Heuer, M. Grant, M. Manohar, K. B. Garbutcheon-Singh, J. Aldrich-Wright, "},{"$f":"J18","v":{"$error":"#VALUE!"}},{"$f":"J26","v":"YEAR ERROR"},{"$f":"K19","v":{"$error":"#VALUE!"}},{"$f":"J24","v":{"$error":"#VALUE!"}},{"$f":"K25","v":{"$error":"#VALUE!"}},"Wiley",{"$f":"J45","v":{"$error":"#VALUE!"}}]
["RE-EXPORT",{"$f":"REFSTORE!G2","v":0},{"$f":"VLOOKUP('J. Am. Chem. Soc.'!$H$4,REFSTORE!$C$6:$K$50000,2)","v":{"$error":"#N/A"}},{"$f":"VLOOKUP('J. Am. Chem. Soc.'!$H$4,REFSTORE!$C$6:$K$50000,3)","v":{"$error":"#N/A"}},{"$f":"VLOOKUP('J. Am. Chem. Soc.'!$H$4,REFSTORE!$C$6:$K$50000,4)","v":{"$error":"#N/A"}},{"$f":"VLOOKUP('J. Am. Chem. Soc.'!$H$4,REFSTORE!$C$6:$K$50000,5)","v":{"$error":"#N/A"}},{"$f":"VLOOKUP('J. Am. Chem. Soc.'!$H$4,REFSTORE!$C$6:$K$50000,6)","v":{"$error":"#N/A"}},{"$f":"VLOOKUP('J. Am. Chem. Soc.'!$H$4,REFSTORE!$C$6:$K$50000,7)","v":{"$error":"#N/A"}},{"$f":"VLOOKUP('J. Am. Chem. Soc.'!$H$4,REFSTORE!$C$6:$K$50000,8)","v":{"$error":"#N/A"}},{"$f":"VLOOKUP('J. Am. Chem. Soc.'!$H$4,REFSTORE!$C$6:$K$50000,9)","v":{"$error":"#N/A"}},"CONC",{"$f":"D4&\", \"&E4&\", \"&F4&\", \"&G4&\", \"&I4","v":{"$error":"#N/A"}}]
[null,null,null,null,null,null,null,null,null,null,"WIKI",{"$f":"\"<ref name=\"\"NAMEHERE\"\">\"&D4&\", ''\"&E4&\"'', \"&F4&\", '''\"&G4&\"''', \"&I4&\" {{DOI|\"&H4&\"}}</ref>\"","v":{"$error":"#N/A"}}]
[]
[]
[]
[]
[]
[]
[]
[]
["CHECK"]
[{"$f":"SUM(A16:A27)","v":12}]
[{"$f":"IF(myextract(B16,1,\"F\",\" \")=\"AUTHOR\",0,1)","v":1},null,null,null,null,null,null,null,null,{"$f":"PROPER(MID((myextract(B16, 2, \"F\", \"{\")), 1, LEN(B16) - 12))","v":{"$error":"#VALUE!"}}]
[{"$f":"IF(myextract(B17,1,\"F\",\" \")=\"TITLE\",0,1)","v":1},null,null,null,null,null,null,null,null,{"$f":"PROPER(MID((myextract(B17,2,\"F\",\"{\")),1,LEN(B17)-11))","v":{"$error":"#VALUE!"}}]
[{"$f":"IF(myextract(B18,1,\"F\",\" \")=\"JOURNAL\",0,1)","v":1},null,null,null,null,null,null,null,null,{"$f":"MID(B18,12,LEN(B18)-13)","v":{"$error":"#VALUE!"}},{"$f":"LEN(J18)+1","v":{"$error":"#VALUE!"}}]
[{"$f":"IF(myextract(B19,1,\"F\",\" \")=\"VOLUME\",0,1)","v":1},null,null,null,null,null,null,null,null,{"$f":"MID(B19,11,LEN(B19)-12)","v":{"$error":"#VALUE!"}},{"$f":"J19&\" (\"&J20&\")\"","v":{"$error":"#VALUE!"}}]
[{"$f":"IF(myextract(B20,1,\"F\",\" \")=\"NUMBER\",0,1)","v":1},null,null,null,null,null,null,null,null,{"$f":"MID(B20,11,LEN(B20)-12)","v":{"$error":"#VALUE!"}}]
[{"$f":"IF(myextract(B21,1,\"F\",\" \")=\"PUBLISHER\",0,1)","v":1},null,null,null,null,null,null,null,null,null,null,"Full Journal",{"$f":"J18&\", \"&J26&\", \"&K19&\", \"&K25","v":{"$error":"#VALUE!"}}]
[{"$f":"IF(myextract(B22,1,\"F\",\" \")=\"ISSN\",0,1)","v":1}]
[{"$f":"IF(myextract(B23,1,\"F\",\" \")=\"URL\",0,1)","v":1}]
[{"$f":"IF(myextract(B24,1,\"F\",\" \")=\"DOI\",0,1)","v":1},null,null,null,null,null,null,null,null,{"$f":"MID(B24,8,LEN(B24)-9)","v":{"$error":"#VALUE!"}}]
[{"$f":"IF(myextract(B25,1,\"F\",\" \")=\"PAGES\",0,1)","v":1},null,null,null,null,null,null,null,null,{"$f":"MID(B25,10,LEN(B25)-11)","v":{"$error":"#VALUE!"}},{"$f":"MID(J25,1,(FIND(\"--\",J25)-1))","v":{"$error":"#VALUE!"}}]
[{"$f":"IF(myextract(B26,1,\"F\",\" \")=\"KEYWORDS\",0,1)","v":1},null,null,null,null,{"$f":"IF(myextract(B26,1,\"F\",\" \")=\"YEAR\",0,1)","v":1},null,null,null,{"$f":"IF(A27=0,(MID(B27,9,LEN(B27)-10)),IF(A28=0,(MID(B26,9,LEN(B26)-10)),\"YEAR ERROR\"))","v":"YEAR ERROR"}]
[{"$f":"IF(myextract(B27,1,\"F\",\" \")=\"YEAR\",0,1)","v":1}]
[{"$f":"IF(myextract(B26,1,\"F\",\" \")=\"YEAR\",0,1)","v":1},null,null,null,null,null,null,null,null,{"$f":"LEN(J29)","v":153}]
[null,null,null,null,null,null,null,null,"Paste Spec Author","Harper, Benjamin W. And Krause-Heuer, Anwen M. And Grant, Maxine P. And Manohar, Madhura And Garbutcheon-Singh, K. Benjamin And Aldrich-Wright, Janice R."]
[null,null,null,null,null,null,null,null,"Counter",1,2,3,4,5,6,7,8,9,10,11,12,13,14,15,16,17,18,19,20,21,22,23,24,25,26,27,28,29,30,31,32,33,34,35,36,37,38,39,40,41,42,43,44,45,46,47,48,49,50,51,52,53,54,55,56,57,58,59,60,61,62,63,64,65,66,67,68,69,70,71,72,73,74,75,76,77,78,79,80,81,82,83,84,85,86,87,88,89,90,91,92,93,94,95,96,97,98,99,100,101,102,103,104,105,106,107,108,109,110,111,112,113,114,115,116,117,118,119,120,121,122,123,124,125,126,127,128,129]
[null,null,null,null,null,null,null,null,"And",{"$f":"myextract($J$29,J30,\"F\",\" \")","v":"Harper,"},{"$f":"myextract($J$29,K30,\"F\",\" \")","v":"Benjamin W."},"And","Krause-Heuer,","Anwen M.","And","Grant,","Maxine P.","And","Manohar,","Madhura","And","Garbutcheon-Singh,","K.","Benjamin","And","Aldrich-Wright,","Janice R.","Harper, Benjamin W. And Krause-Heuer, Anwen M. And Grant, Maxine P. And Manohar, Madhura And Garbutcheon-Singh, K. Benjamin And Aldrich-Wright, Janice R.","Harper, Benjamin W. And Krause-Heuer, Anwen M. And Grant, Maxine P. And Manohar, Madhura And Garbutcheon-Singh, K. Benjamin And Aldrich-Wright, Janice R.","Harper, Benjamin W. And Krause-Heuer, Anwen M. And Grant, Maxine P. And Manohar, Madhura And Garbutcheon-Singh, K. Benjamin And Aldrich-Wright, Janice R.","Harper, Benjamin W. And Krause-Heuer, Anwen M. And Grant, Maxine P. And Manohar, Madhura And Garbutcheon-Singh, K. Benjamin And Aldrich-Wright, Janice R.","Harper, Benjamin W. And Krause-Heuer, Anwen M. And Grant, Maxine P. And Manohar, Madhura And Garbutcheon-Singh, K. Benjamin And Aldrich-Wright, Janice R.","Harper, Benjamin W. And Krause-Heuer, Anwen M. And Grant, Maxine P. And Manohar, Madhura And Garbutcheon-Singh, K. Benjamin And Aldrich-Wright, Janice R.","Harper, Benjamin W. And Krause-Heuer, Anwen M. And Grant, Maxine P. And Manohar, Madhura And Garbutcheon-Singh, K. Benjamin And Aldrich-Wright, Janice R.","Harper, Benjamin W. And Krause-Heuer, Anwen M. And Grant, Maxine P. And Manohar, Madhura And Garbutcheon-Singh, K. Benjamin And Aldrich-Wright, Janice R.","Harper, Benjamin W. And Krause-Heuer, Anwen M. And Grant, Maxine P. And Manohar, Madhura And Garbutcheon-Singh, K. Benjamin And Aldrich-Wright, Janice R.","Harper, Benjamin W. And Krause-Heuer, Anwen M. And Grant, Maxine P. And Manohar, Madhura And Garbutcheon-Singh, K. Benjamin And Aldrich-Wright, Janice R.","Harper, Benjamin W. And Krause-Heuer, Anwen M. And Grant, Maxine P. And Manohar, Madhura And Garbutcheon-Singh, K. Benjamin And Aldrich-Wright, Janice R.","Harper, Benjamin W. And Krause-Heuer, Anwen M. And Grant, Maxine P. And Manohar, Madhura And Garbutcheon-Singh, K. Benjamin And Aldrich-Wright, Janice R.","Harper, Benjamin W. And Krause-Heuer, Anwen M. And Grant, Maxine P. And Manohar, Madhura And Garbutcheon-Singh, K. Benjamin And Aldrich-Wright, Janice R.","Harper, Benjamin W. And Krause-Heuer, Anwen M. And Grant, Maxine P. And Manohar, Madhura And Garbutcheon-Singh, K. Benjamin And Aldrich-Wright, Janice R.","Harper, Benjamin W. And Krause-Heuer, Anwen M. And Grant, Maxine P. And Manohar, Madhura And Garbutcheon-Singh, K. Benjamin And Aldrich-Wright, Janice R.","Harper, Benjamin W. And Krause-Heuer, Anwen M. And Grant, Maxine P. And Manohar, Madhura And Garbutcheon-Singh, K. Benjamin And Aldrich-Wright, Janice R.","Harper, Benjamin W. And Krause-Heuer, Anwen M. And Grant, Maxine P. And Manohar, Madhura And Garbutcheon-Singh, K. Benjamin And Aldrich-Wright, Janice R.","Harper, Benjamin W. And Krause-Heuer, Anwen M. And Grant, Maxine P. And Manohar, Madhura And Garbutcheon-Singh, K. Benjamin And Aldrich-Wright, Janice R.","Harper, Benjamin W. And Krause-Heuer, Anwen M. And Grant, Maxine P. And Manohar, Madhura And Garbutcheon-Singh, K. Benjamin And Aldrich-Wright, Janice R.","Harper, Benjamin W. And Krause-Heuer, Anwen M. And Grant, Maxine P. And Manohar, Madhura And Garbutcheon-Singh, K. Benjamin And Aldrich-Wright, Janice R.","Harper, Benjamin W. And Krause-Heuer, Anwen M. And Grant, Maxine P. And Manohar, Madhura And Garbutcheon-Singh, K. Benjamin And Aldrich-Wright, Janice R.","Harper, Benjamin W. And Krause-Heuer, Anwen M. And Grant, Maxine P. And Manohar, Madhura And Garbutcheon-Singh, K. Benjamin And Aldrich-Wright, Janice R.","Harper, Benjamin W. And Krause-Heuer, Anwen M. And Grant, Maxine P. And Manohar, Madhura And Garbutcheon-Singh, K. Benjamin And Aldrich-Wright, Janice R.","Harper, Benjamin W. And Krause-Heuer, Anwen M. And Grant, Maxine P. And Manohar, Madhura And Garbutcheon-Singh, K. Benjamin And Aldrich-Wright, Janice R.","Harper, Benjamin W. And Krause-Heuer, Anwen M. And Grant, Maxine P. And Manohar, Madhura And Garbutcheon-Singh, K. Benjamin And Aldrich-Wright, Janice R.","Harper, Benjamin W. And Krause-Heuer, Anwen M. And Grant, Maxine P. And Manohar, Madhura And Garbutcheon-Singh, K. Benjamin And Aldrich-Wright, Janice R.","Harper, Benjamin W. And Krause-Heuer, Anwen M. And Grant, Maxine P. And Manohar, Madhura And Garbutcheon-Singh, K. Benjamin And Aldrich-Wright, Janice R.","Harper, Benjamin W. And Krause-Heuer, Anwen M. And Grant, Maxine P. And Manohar, Madhura And Garbutcheon-Singh, K. Benjamin And Aldrich-Wright, Janice R.","Harper, Benjamin W. And Krause-Heuer, Anwen M. And Grant, Maxine P. And Manohar, Madhura And Garbutcheon-Singh, K. Benjamin And Aldrich-Wright, Janice R.","Harper, Benjamin W. And Krause-Heuer, Anwen M. And Grant, Maxine P. And Manohar, Madhura And Garbutcheon-Singh, K. Benjamin And Aldrich-Wright, Janice R.","Harper, Benjamin W. And Krause-Heuer, Anwen M. And Grant, Maxine P. And Manohar, Madhura And Garbutcheon-Singh, K. Benjamin And Aldrich-Wright, Janice R.","Harper, Benjamin W. And Krause-Heuer, Anwen M. And Grant, Maxine P. And Manohar, Madhura And Garbutcheon-Singh, K. Benjamin And Aldrich-Wright, Janice R.","Harper, Benjamin W. And Krause-Heuer, Anwen M. And Grant, Maxine P. And Manohar, Madhura And Garbutcheon-Singh, K. Benjamin And Aldrich-Wright, Janice R.","Harper, Benjamin W. And Krause-Heuer, Anwen M. And Grant, Maxine P. And Manohar, Madhura And Garbutcheon-Singh, K. Benjamin And Aldrich-Wright, Janice R.","Harper, Benjamin W. And Krause-Heuer, Anwen M. And Grant, Maxine P. And Manohar, Madhura And Garbutcheon-Singh, K. Benjamin And Aldrich-Wright, Janice R.","Harper, Benjamin W. And Krause-Heuer, Anwen M. And Grant, Maxine P. And Manohar, Madhura And Garbutcheon-Singh, K. Benjamin And Aldrich-Wright, Janice R.","Harper, Benjamin W. And Krause-Heuer, Anwen M. And Grant, Maxine P. And Manohar, Madhura And Garbutcheon-Singh, K. Benjamin And Aldrich-Wright, Janice R.","Harper, Benjamin W. And Krause-Heuer, Anwen M. And Grant, Maxine P. And Manohar, Madhura And Garbutcheon-Singh, K. Benjamin And Aldrich-Wright, Janice R.","Harper, Benjamin W. And Krause-Heuer, Anwen M. And Grant, Maxine P. And Manohar, Madhura And Garbutcheon-Singh, K. Benjamin And Aldrich-Wright, Janice R.","Harper, Benjamin W. And Krause-Heuer, Anwen M. And Grant, Maxine P. And Manohar, Madhura And Garbutcheon-Singh, K. Benjamin And Aldrich-Wright, Janice R.","Harper, Benjamin W. And Krause-Heuer, Anwen M. And Grant, Maxine P. And Manohar, Madhura And Garbutcheon-Singh, K. Benjamin And Aldrich-Wright, Janice R.","Harper, Benjamin W. And Krause-Heuer, Anwen M. And Grant, Maxine P. And Manohar, Madhura And Garbutcheon-Singh, K. Benjamin And Aldrich-Wright, Janice R.","Harper, Benjamin W. And Krause-Heuer, Anwen M. And Grant, Maxine P. And Manohar, Madhura And Garbutcheon-Singh, K. Benjamin And Aldrich-Wright, Janice R.","Harper, Benjamin W. And Krause-Heuer, Anwen M. And Grant, Maxine P. And Manohar, Madhura And Garbutcheon-Singh, K. Benjamin And Aldrich-Wright, Janice R.","Harper, Benjamin W. And Krause-Heuer, Anwen M. And Grant, Maxine P. And Manohar, Madhura And Garbutcheon-Singh, K. Benjamin And Aldrich-Wright, Janice R.","Harper, Benjamin W. And Krause-Heuer, Anwen M. And Grant, Maxine P. And Manohar, Madhura And Garbutcheon-Singh, K. Benjamin And Aldrich-Wright, Janice R.","Harper, Benjamin W. And Krause-Heuer, Anwen M. And Grant, Maxine P. And Manohar, Madhura And Garbutcheon-Singh, K. Benjamin And Aldrich-Wright, Janice R.",{"$f":"myextract($J$29,BW30,\"F\",\" \")","v":"Harper, Benjamin W. And Krause-Heuer, Anwen M. And Grant, Maxine P. And Manohar, Madhura And Garbutcheon-Singh, K. Benjamin And Aldrich-Wright, Janice R."},"Harper, Benjamin W. And Krause-Heuer, Anwen M. And Grant, Maxine P. And Manohar, Madhura And Garbutcheon-Singh, K. Benjamin And Aldrich-Wright, Janice R.","Harper, Benjamin W. And Krause-Heuer, Anwen M. And Grant, Maxine P. And Manohar, Madhura And Garbutcheon-Singh, K. Benjamin And Aldrich-Wright, Janice R.","Harper, Benjamin W. And Krause-Heuer, Anwen M. And Grant, Maxine P. And Manohar, Madhura And Garbutcheon-Singh, K. Benjamin And Aldrich-Wright, Janice R.","Harper, Benjamin W. And Krause-Heuer, Anwen M. And Grant, Maxine P. And Manohar, Madhura And Garbutcheon-Singh, K. Benjamin And Aldrich-Wright, Janice R.","Harper, Benjamin W. And Krause-Heuer, Anwen M. And Grant, Maxine P. And Manohar, Madhura And Garbutcheon-Singh, K. Benjamin And Aldrich-Wright, Janice R.","Harper, Benjamin W. And Krause-Heuer, Anwen M. And Grant, Maxine P. And Manohar, Madhura And Garbutcheon-Singh, K. Benjamin And Aldrich-Wright, Janice R.","Harper, Benjamin W. And Krause-Heuer, Anwen M. And Grant, Maxine P. And Manohar, Madhura And Garbutcheon-Singh, K. Benjamin And Aldrich-Wright, Janice R.","Harper, Benjamin W. And Krause-Heuer, Anwen M. And Grant, Maxine P. And Manohar, Madhura And Garbutcheon-Singh, K. Benjamin And Aldrich-Wright, Janice R.","Harper, Benjamin W. And Krause-Heuer, Anwen M. And Grant, Maxine P. And Manohar, Madhura And Garbutcheon-Singh, K. Benjamin And Aldrich-Wright, Janice R.","Harper, Benjamin W. And Krause-Heuer, Anwen M. And Grant, Maxine P. And Manohar, Madhura And Garbutcheon-Singh, K. Benjamin And Aldrich-Wright, Janice R.","Harper, Benjamin W. And Krause-Heuer, Anwen M. And Grant, Maxine P. And Manohar, Madhura And Garbutcheon-Singh, K. Benjamin And Aldrich-Wright, Janice R.","Harper, Benjamin W. And Krause-Heuer, Anwen M. And Grant, Maxine P. And Manohar, Madhura And Garbutcheon-Singh, K. Benjamin And Aldrich-Wright, Janice R.","Harper, Benjamin W. And Krause-Heuer, Anwen M. And Grant, Maxine P. And Manohar, Madhura And Garbutcheon-Singh, K. Benjamin And Aldrich-Wright, Janice R.","Harper, Benjamin W. And Krause-Heuer, Anwen M. And Grant, Maxine P. And Manohar, Madhura And Garbutcheon-Singh, K. Benjamin And Aldrich-Wright, Janice R.","Harper, Benjamin W. And Krause-Heuer, Anwen M. And Grant, Maxine P. And Manohar, Madhura And Garbutcheon-Singh, K. Benjamin And Aldrich-Wright, Janice R.","Harper, Benjamin W. And Krause-Heuer, Anwen M. And Grant, Maxine P. And Manohar, Madhura And Garbutcheon-Singh, K. Benjamin And Aldrich-Wright, Janice R.","Harper, Benjamin W. And Krause-Heuer, Anwen M. And Grant, Maxine P. And Manohar, Madhura And Garbutcheon-Singh, K. Benjamin And Aldrich-Wright, Janice R.","Harper, Benjamin W. And Krause-Heuer, Anwen M. And Grant, Maxine P. And Manohar, Madhura And Garbutcheon-Singh, K. Benjamin And Aldrich-Wright, Janice R.","Harper, Benjamin W. And Krause-Heuer, Anwen M. And Grant, Maxine P. And Manohar, Madhura And Garbutcheon-Singh, K. Benjamin And Aldrich-Wright, Janice R.","Harper, Benjamin W. And Krause-Heuer, Anwen M. And Grant, Maxine P. And Manohar, Madhura And Garbutcheon-Singh, K. Benjamin And Aldrich-Wright, Janice R.","Harper, Benjamin W. And Krause-Heuer, Anwen M. And Grant, Maxine P. And Manohar, Madhura And Garbutcheon-Singh, K. Benjamin And Aldrich-Wright, Janice R.","Harper, Benjamin W. And Krause-Heuer, Anwen M. And Grant, Maxine P. And Manohar, Madhura And Garbutcheon-Singh, K. Benjamin And Aldrich-Wright, Janice R.","Harper, Benjamin W. And Krause-Heuer, Anwen M. And Grant, Maxine P. And Manohar, Madhura And Garbutcheon-Singh, K. Benjamin And Aldrich-Wright, Janice R.","Harper, Benjamin W. And Krause-Heuer, Anwen M. And Grant, Maxine P. And Manohar, Madhura And Garbutcheon-Singh, K. Benjamin And Aldrich-Wright, Janice R.","Harper, Benjamin W. And Krause-Heuer, Anwen M. And Grant, Maxine P. And Manohar, Madhura And Garbutcheon-Singh, K. Benjamin And Aldrich-Wright, Janice R.","Harper, Benjamin W. And Krause-Heuer, Anwen M. And Grant, Maxine P. And Manohar, Madhura And Garbutcheon-Singh, K. Benjamin And Aldrich-Wright, Janice R.","Harper, Benjamin W. And Krause-Heuer, Anwen M. And Grant, Maxine P. And Manohar, Madhura And Garbutcheon-Singh, K. Benjamin And Aldrich-Wright, Janice R.","Harper, Benjamin W. And Krause-Heuer, Anwen M. And Grant, Maxine P. And Manohar, Madhura And Garbutcheon-Singh, K. Benjamin And Aldrich-Wright, Janice R.","Harper, Benjamin W. And Krause-Heuer, Anwen M. And Grant, Maxine P. And Manohar, Madhura And Garbutcheon-Singh, K. Benjamin And Aldrich-Wright, Janice R.","Harper, Benjamin W. And Krause-Heuer, Anwen M. And Grant, Maxine P. And Manohar, Madhura And Garbutcheon-Singh, K. Benjamin And Aldrich-Wright, Janice R.","Harper, Benjamin W. And Krause-Heuer, Anwen M. And Grant, Maxine P. And Manohar, Madhura And Garbutcheon-Singh, K. Benjamin And Aldrich-Wright, Janice R.","Harper, Benjamin W. And Krause-Heuer, Anwen M. And Grant, Maxine P. And Manohar, Madhura And Garbutcheon-Singh, K. Benjamin And Aldrich-Wright, Janice R.","Harper, Benjamin W. And Krause-Heuer, Anwen M. And Grant, Maxine P. And Manohar, Madhura And Garbutcheon-Singh, K. Benjamin And Aldrich-Wright, Janice R.","Harper, Benjamin W. And Krause-Heuer, Anwen M. And Grant, Maxine P. And Manohar, Madhura And Garbutcheon-Singh, K. Benjamin And Aldrich-Wright, Janice R.","Harper, Benjamin W. And Krause-Heuer, Anwen M. And Grant, Maxine P. And Manohar, Madhura And Garbutcheon-Singh, K. Benjamin And Aldrich-Wright, Janice R.","Harper, Benjamin W. And Krause-Heuer, Anwen M. And Grant, Maxine P. And Manohar, Madhura And Garbutcheon-Singh, K. Benjamin And Aldrich-Wright, Janice R.","Harper, Benjamin W. And Krause-Heuer, Anwen M. And Grant, Maxine P. And Manohar, Madhura And Garbutcheon-Singh, K. Benjamin And Aldrich-Wright, Janice R.","Harper, Benjamin W. And Krause-Heuer, Anwen M. And Grant, Maxine P. And Manohar, Madhura And Garbutcheon-Singh, K. Benjamin And Aldrich-Wright, Janice R.","Harper, Benjamin W. And Krause-Heuer, Anwen M. And Grant, Maxine P. And Manohar, Madhura And Garbutcheon-Singh, K. Benjamin And Aldrich-Wright, Janice R.","Harper, Benjamin W. And Krause-Heuer, Anwen M. And Grant, Maxine P. And Manohar, Madhura And Garbutcheon-Singh, K. Benjamin And Aldrich-Wright, Janice R.","Harper, Benjamin W. And Krause-Heuer, Anwen M. And Grant, Maxine P. And Manohar, Madhura And Garbutcheon-Singh, K. Benjamin And Aldrich-Wright, Janice R.","Harper, Benjamin W. And Krause-Heuer, Anwen M. And Grant, Maxine P. And Manohar, Madhura And Garbutcheon-Singh, K. Benjamin And Aldrich-Wright, Janice R.","Harper, Benjamin W. And Krause-Heuer, Anwen M. And Grant, Maxine P. And Manohar, Madhura And Garbutcheon-Singh, K. Benjamin And Aldrich-Wright, Janice R.","Harper, Benjamin W. And Krause-Heuer, Anwen M. And Grant, Maxine P. And Manohar, Madhura And Garbutcheon-Singh, K. Benjamin And Aldrich-Wright, Janice R.","Harper, Benjamin W. And Krause-Heuer, Anwen M. And Grant, Maxine P. And Manohar, Madhura And Garbutcheon-Singh, K. Benjamin And Aldrich-Wright, Janice R.","Harper, Benjamin W. And Krause-Heuer, Anwen M. And Grant, Maxine P. And Manohar, Madhura And Garbutcheon-Singh, K. Benjamin And Aldrich-Wright, Janice R.","Harper, Benjamin W. And Krause-Heuer, Anwen M. And Grant, Maxine P. And Manohar, Madhura And Garbutcheon-Singh, K. Benjamin And Aldrich-Wright, Janice R.","Harper, Benjamin W. And Krause-Heuer, Anwen M. And Grant, Maxine P. And Manohar, Madhura And Garbutcheon-Singh, K. Benjamin And Aldrich-Wright, Janice R.","Harper, Benjamin W. And Krause-Heuer, Anwen M. And Grant, Maxine P. And Manohar, Madhura And Garbutcheon-Singh, K. Benjamin And Aldrich-Wright, Janice R.","Harper, Benjamin W. And Krause-Heuer, Anwen M. And Grant, Maxine P. And Manohar, Madhura And Garbutcheon-Singh, K. Benjamin And Aldrich-Wright, Janice R.","Harper, Benjamin W. And Krause-Heuer, Anwen M. And Grant, Maxine P. And Manohar, Madhura And Garbutcheon-Singh, K. Benjamin And Aldrich-Wright, Janice R.","Harper, Benjamin W. And Krause-Heuer, Anwen M. And Grant, Maxine P. And Manohar, Madhura And Garbutcheon-Singh, K. Benjamin And Aldrich-Wright, Janice R.","Harper, Benjamin W. And Krause-Heuer, Anwen M. And Grant, Maxine P. And Manohar, Madhura And Garbutcheon-Singh, K. Benjamin And Aldrich-Wright, Janice R.","Harper, Benjamin W. And Krause-Heuer, Anwen M. And Grant, Maxine P. And Manohar, Madhura And Garbutcheon-Singh, K. Benjamin And Aldrich-Wright, Janice R.","Harper, Benjamin W. And Krause-Heuer, Anwen M. And Grant, Maxine P. And Manohar, Madhura And Garbutcheon-Singh, K. Benjamin And Aldrich-Wright, Janice R.","Harper, Benjamin W. And Krause-Heuer, Anwen M. And Grant, Maxine P. And Manohar, Madhura And Garbutcheon-Singh, K. Benjamin And Aldrich-Wright, Janice R.","Harper, Benjamin W. And Krause-Heuer, Anwen M. And Grant, Maxine P. And Manohar, Madhura And Garbutcheon-Singh, K. Benjamin And Aldrich-Wright, Janice R.","Harper, Benjamin W. And Krause-Heuer, Anwen M. And Grant, Maxine P. And Manohar, Madhura And Garbutcheon-Singh, K. Benjamin And Aldrich-Wright, Janice R.","Harper, Benjamin W. And Krause-Heuer, Anwen M. And Grant, Maxine P. And Manohar, Madhura And Garbutcheon-Singh, K. Benjamin And Aldrich-Wright, Janice R.","Harper, Benjamin W. And Krause-Heuer, Anwen M. And Grant, Maxine P. And Manohar, Madhura And Garbutcheon-Singh, K. Benjamin And Aldrich-Wright, Janice R.","Harper, Benjamin W. And Krause-Heuer, Anwen M. And Grant, Maxine P. And Manohar, Madhura And Garbutcheon-Singh, K. Benjamin And Aldrich-Wright, Janice R.","Harper, Benjamin W. And Krause-Heuer, Anwen M. And Grant, Maxine P. And Manohar, Madhura And Garbutcheon-Singh, K. Benjamin And Aldrich-Wright, Janice R.","Harper, Benjamin W. And Krause-Heuer, Anwen M. And Grant, Maxine P. And Manohar, Madhura And Garbutcheon-Singh, K. Benjamin And Aldrich-Wright, Janice R."]
[null,null,null,null,null,null,null,null,"INITIALISE",{"$f":"IF(I31=\"And\",J31,IF(J31=\"And\",\"\",LEFT(J31,1)&\".\"))","v":"Harper,"},{"$f":"IF(J31=\"And\",K31,IF(K31=\"And\",\"\",LEFT(K31,1)&\".\"))","v":"B."},"","Krause-Heuer,","A.","","Grant,","M.","","Manohar,","M.","","Garbutcheon-Singh,","K.","B.","","Aldrich-Wright,","J.","H.","H.","H.","H.","H.","H.","H.","H.","H.","H.","H.","H.","H.","H.","H.","H.","H.","H.","H.","H.","H.","H.","H.","H.","H.","H.","H.","H.","H.","H.","H.","H.","H.","H.","H.","H.","H.","H.","H.","H.","H.","H.","H.","H.","H.","H.","H.",{"$f":"IF(BV31=\"And\",BW31,IF(BW31=\"And\",\"\",LEFT(BW31,1)&\".\"))","v":"H."},"H.","H.","H.","H.","H.","H.","H.","H.","H.","H.","H.","H.","H.","H.","H.","H.","H.","H.","H.","H.","H.","H.","H.","H.","H.","H.","H.","H.","H.","H.","H.","H.","H.","H.","H.","H.","H.","H.","H.","H.","H.","H.","H.","H.","H.","H.","H.","H.","H.","H.","H.","H.","H.","H.","H.","H.","H.","H.","H.","H.","H.","H.","H."]
["deletes to here",null,null,null,null,null,null,null,"LEN",{"$f":"LEN(J31)","v":7},{"$f":"LEN(K31)","v":11},3,13,8,3,6,9,3,8,7,3,18,2,8,3,15,9,153,153,153,153,153,153,153,153,153,153,153,153,153,153,153,153,153,153,153,153,153,153,153,153,153,153,153,153,153,153,153,153,153,153,153,153,153,153,153,153,153,153,153,153,153,153,153,{"$f":"LEN(BW31)","v":153},153,153,153,153,153,153,153,153,153,153,153,153,153,153,153,153,153,153,153,153,153,153,153,153,153,153,153,153,153,153,153,153,153,153,153,153,153,153,153,153,153,153,153,153,153,153,153,153,153,153,153,153,153,153,153,153,153,153,153,153,153,153,153]
[null,null,null,null,null,null,null,"Active?",null,{"$f":"IF(J32=\"\",\"\",(IF(J33=$J$28,\"\",J32&\" \")))","v":"Harper, "},"B. ","","Krause-Heuer, ","A. ","","Grant, ",{"$f":"IF(Q32=\"\",\"\",(IF(Q33=$J$28,\"\",Q32&\" \")))","v":"M. "},"","Manohar, ","M. ","","Garbutcheon-Singh, ","K. ","B. ","","Aldrich-Wright, ","J. ","","","","","","","","","","","","","","","","","","","","","","","","","","","","","","","","","","","","","","","","","","","","","","","","","","","","","",{"$f":"IF(CC32=\"\",\"\",(IF(CC33=$J$28,\"\",CC32&\" \")))","v":""},"","","","","","","","","","","","","","","","","","","","","","","","","","","","","","","","","","","","","","","","","","","","","","","","","","","","","","","","",""]
[]
[null,null,null,null,null,null,null,"Com Name",null,{"$f":"IF(I34=\"\",IF(K34=\"\",J34,IF(L34=\"\",CONCATENATE(K34,J34),IF(M34=\"\",CONCATENATE(K34,L34,J34),IF(N34=\"\",CONCATENATE(K34,L34,M34,J34),IF(O34=\"\",CONCATENATE(K34,L34,M34,N34,J34),\"A NAME HAS TOO MANY INITIALS\"))))),\"\")","v":"B. Harper, "},{"$f":"IF(J34=\"\",IF(L34=\"\",K34,IF(M34=\"\",CONCATENATE(L34,K34),IF(N34=\"\",CONCATENATE(L34,M34,K34),IF(O34=\"\",CONCATENATE(L34,M34,N34,K34),IF(P34=\"\",CONCATENATE(L34,M34,N34,O34,K34),\"A NAME HAS TOO MANY INITIALS\"))))),\"\")","v":""},"","A. Krause-Heuer, ","","","M. Grant, ","","","M. Manohar, ","","","K. B. Garbutcheon-Singh, ","","","","J. Aldrich-Wright, ","","","","","","","","","","","","","","","","","","","","","","","","","","","","","","","","","","","","","","","","","","","","","","","","",{"$f":"IF(BV34=\"\",IF(BX34=\"\",BW34,IF(BY34=\"\",CONCATENATE(BX34,BW34),IF(BZ34=\"\",CONCATENATE(BX34,BY34,BW34),IF(CA34=\"\",CONCATENATE(BX34,BY34,BZ34,BW34),IF(CB34=\"\",CONCATENATE(BX34,BY34,BZ34,CA34,BW34),\"A NAME HAS TOO MANY INITIALS\"))))),\"\")","v":""},"","","","","","","","","","","","","","","","","","","","","","","","","","","","","","","","","","","","","","","","","","","","","","","","","","","","","","","","","","","","","","",""]
[]
[null,null,null,null,null,null,null,null,"Com Name",{"$f":"CONCATENATE(J36,K38)","v":"B. Harper, A. Krause-Heuer, M. Grant, M. Manohar, K. B. Garbutcheon-Singh, J. Aldrich-Wright, "},{"$f":"CONCATENATE(K36,L38)","v":"A. Krause-Heuer, M. Grant, M. Manohar, K. B. Garbutcheon-Singh, J. Aldrich-Wright, "},"A. Krause-Heuer, M. Grant, M. Manohar, K. B. Garbutcheon-Singh, J. Aldrich-Wright, ","A. Krause-Heuer, M. Grant, M. Manohar, K. B. Garbutcheon-Singh, J. Aldrich-Wright, ","M. Grant, M. Manohar, K. B. Garbutcheon-Singh, J. Aldrich-Wright, ","M. Grant, M. Manohar, K. B. Garbutcheon-Singh, J. Aldrich-Wright, ","M. Grant, M. Manohar, K. B. Garbutcheon-Singh, J. Aldrich-Wright, ","M. Manohar, K. B. Garbutcheon-Singh, J. Aldrich-Wright, ","M. Manohar, K. B. Garbutcheon-Singh, J. Aldrich-Wright, ","M. Manohar, K. B. Garbutcheon-Singh, J. Aldrich-Wright, ","K. B. Garbutcheon-Singh, J. Aldrich-Wright, ","K. B. Garbutcheon-Singh, J. Aldrich-Wright, ","K. B. Garbutcheon-Singh, J. Aldrich-Wright, ","J. Aldrich-Wright, ","J. Aldrich-Wright, ","J. Aldrich-Wright, ","J. Aldrich-Wright, ","","","","","","","","","","","","","","","","","","","","","","","","","","","","","","","","","","","","","","","","","","","","","","","","",{"$f":"CONCATENATE(BW36,BX38)","v":""},"","","","","","","","","","","","","","","","","","","","","","","","","","","","","","","","","","","","","","","","","","","","","","","","","","","","","","","","","","","","","",""]
[null,null,null,null,null,null,null,null,"Real Len",{"$f":"LEN(J38)","v":94},"Names + journal Len",null,{"$f":"J39+K18+2+6","v":{"$error":"#VALUE!"}}]
[null,null,null,null,null,null,null,null,"Plus Journal",{"$f":"J38&M21","v":{"$error":"#VALUE!"}}]
[null,null,null,null,null,null,null,null,"Format","B. Harper, A. Krause-Heuer, M. Grant, M. Manohar, K. B. Garbutcheon-Singh, J. Aldrich-Wright, Chemistry – A European Journal, 2010, 16 (24), 7064"]
[]
[]
[]
[null,null,null,null,null,null,null,null,"Wiki",{"$f":"\"<ref name=\"\"\"&J17&\"\"\">\"&J38&\"''\"&J18&\"'', \"&J26&\", '''\"&K19&\"''', \"&K25&\" {{DOI|\"&J24&\"}}</ref>\"","v":{"$error":"#VALUE!"}}]

{"sheet":"Springerlink","index":7,"n_rows":39,"n_cols":103,"rows_kept":39,"cut":false,"hidden":true,"merged":[]}
[]
[]
[null,null,null,null,null,null,null,"READY?","sum of 2"]
["AUTHORS",null,null,null,null,null,null,{"$f":"IF(B4<>\"\",1,0)","v":0},{"$f":"H4+H5","v":0}]
["JOURNAL",null,null,null,null,null,null,{"$f":"IF(B5<>\"\",1,0)","v":0},{"$f":"H5+H6","v":0}]
["data",null,null,null,null,null,null,{"$f":"IF(B6<>\"\",1,0)","v":0},{"$f":"H6+H7","v":0}]
["year",null,null,null,null,null,null,{"$f":"IF(B7<>\"\",1,0)","v":0}]
[]
[null,"Journal","Year","Vol (no)","p/pp page","page","together",null,null,null,"DOI:"]
["Journal",{"$f":"B5","v":0},{"$f":"B7","v":0},{"$f":"IF(F12=\"R\",(MID(B6,8,(D11-8))&\" (\"&E12&\")\"),(MID(B6,8,(D11-8))&\" (\"&E13&\")\"))","v":{"$error":"#VALUE!"}},{"$f":"myextract(B6,3,\"F\",\",\")","v":"*"},{"$f":"MID(E10,2,FIND(\"-\",E10)-2)","v":{"$error":"#VALUE!"}},{"$f":"B10&\", \"&C10&\", \"&D10&\", \"&F10","v":{"$error":"#VALUE!"}},null,null,null,{"$f":"myextract(B6,1,\"B\",\" \")","v":"*"}]
["len journal",{"$f":"LEN(B10)","v":1},"find",{"$f":"FIND(\",\",B6)","v":{"$error":"#VALUE!"}},"NO","r OR S?"]
[null,null,"find",{"$f":"FIND(\",\",B6,D11+1)","v":{"$error":"#VALUE!"}},{"$f":"MID(B6,D11+9,D12-D11-9)","v":{"$error":"#VALUE!"}},{"$f":"MID(B6,D11+7,D12-D11-9)","v":{"$error":"#VALUE!"}}]
[null,null,null,"No Space",{"$f":"MID(E12,2,LEN(E12)-1)","v":{"$error":"#VALUE!"}}]
["Authors",{"$f":"B4","v":0}]
["plus comma",{"$f":"B14&\",\"","v":"0,"},{"$f":"LEN(B10)+LEN(C10)+2","v":4}]
["Len string",{"$f":"LEN(B15)","v":2}]
["Count Term",1,2,3,4,5,6,7,8,9,10,11,12,13,14,15,16,17,18,19,20,21,22,23,24,25,26,27,28,29,30,31,32,33,34,35,36,37,38,39,40,41,42,43,44,45,46,47,48,49,50,51,52,53,54,55,56,57,58,59,60,61,62,63,64,65,66,67,68,69,70,71,72,73,74,75,76,77,78,79,80,81,82,83,84,85,86,87,88,89,90,91,92,93,94,95,96,97,98,99,100,101,102]
["Split Words",{"$f":"myextract($B$15,B17,\"F\",\" \")","v":"*"},{"$f":"myextract($B$15,C17,\"F\",\" \")","v":"*"},"*","*","*","*","*","*","*","*","*","*","*","*","*","*","*","*","*","*","*","*","*","*","*","*","*","*","*","*","*","*","*","*","*","*","*","*","*","*","*","*","*","*","*","*","*","*","*","*","*","*","*","*","*","*","*","*","*","*","*","*","*","*","*",{"$f":"myextract($B$15,BO17,\"F\",\" \")","v":"*"},"*","*","*","*","*","*","*","*","*","*","*","*","*","*","*","*","*","*","*","*","*","*","*","*","*","*","*","*","*","*","*","*","*","*","*","*"]
["Initialise",{"$f":"IF(RIGHT(B18,1)=\",\",B18,(LEFT(B18,1))&\".\")","v":"*."},{"$f":"IF(RIGHT(C18,1)=\",\",C18,(LEFT(C18,1))&\".\")","v":"*."},"*.","*.","*.","*.","*.","*.","*.","*.","*.","*.","*.","*.","*.","*.","*.","*.","*.","*.","*.","*.","*.","*.","*.","*.","*.","*.","*.","*.","*.","*.","*.","*.","*.","*.","*.","*.","*.","*.","*.","*.","*.","*.","*.","*.","*.","*.","*.","*.","*.","*.","*.","*.","*.","*.","*.","*.","*.","*.","*.","*.","*.","*.",{"$f":"IF(RIGHT(BN18,1)=\",\",BN18,(LEFT(BN18,1))&\".\")","v":"*."},"*.","*.","*.","*.","*.","*.","*.","*.","*.","*.","*.","*.","*.","*.","*.","*.","*.","*.","*.","*.","*.","*.","*.","*.","*.","*.","*.","*.","*.","*.","*.","*.","*.","*.","*.","*.","*."]
["Len",{"$f":"LEN(B19)","v":2},{"$f":"LEN(C19)","v":2},2,2,2,2,2,2,2,2,2,2,2,2,2,2,2,2,2,2,2,2,2,2,2,2,2,2,2,2,2,2,2,2,2,2,2,2,2,2,2,2,2,2,2,2,2,2,2,2,2,2,2,2,2,2,2,2,2,2,2,2,2,2,2,{"$f":"LEN(BO19)","v":2},2,2,2,2,2,2,2,2,2,2,2,2,2,2,2,2,2,2,2,2,2,2,2,2,2,2,2,2,2,2,2,2,2,2,2,2]
["Active?",{"$f":"IF(B20=0,\"\",IF(B20=$B$16,\"\",B19&\" \"))","v":""},{"$f":"IF(C20=0,\"\",IF(C20=$B$16,\"\",C19&\" \"))","v":""},"","","","","","","","","","","","","","","","","","","","","","","","","","","","","","","","","","","","","","","","","","","","","","","","","","","","","","","","","","","","","","","",{"$f":"IF(BO20=0,\"\",IF(BO20=$B$16,\"\",BO19&\" \"))","v":""},"","","","","","","","","","","","","","","","","","","","","","","","","","","","","","","","","","","",""]
["len authors+1",{"$f":"LEN(B23)+1","v":1},"Total",{"$f":"B22+C15+2","v":7}]
["Com Name",{"$f":"CONCATENATE(B21,C23)","v":""},{"$f":"CONCATENATE(C21,D23)","v":""},"","","","","","","","","","","","","","","","","","","","","","","","","","","","","","","","","","","","","","","","","","","","","","","","","","","","","","","","","","","","","","","",{"$f":"CONCATENATE(BO21,BP23)","v":""},"","","","","","","","","","","","","","","","","","","","","","","","","","","","","","","","","","","",""]
["Plus Journal",{"$f":"B23&G10","v":{"$error":"#VALUE!"}}]
["Format","P. T. Lewis, K. Wähälä, Molecules Online, 1999, 2 (10-11), 137"]
[]
[]
[]
["Wiki",{"$f":"\"<ref name=\"\"NAMEHERE\"\">\"&B23&\"''\"&B10&\"'', \"&C10&\", '''\"&D10&\"''', \"&F10&\" {{DOI|\"&K10&\"}}</ref>\"","v":{"$error":"#VALUE!"}}]
[]
[]
[]
[]
[]
[]
["ID","DATE","AUTHOR","JOURNAL","YEAR","VOLUME (No)","DOI","PAGE","IMPORT","WIKI"]
[null,{"$f":"TODAY()","v":"2011-03-18"},{"$f":"B23","v":""},{"$f":"B10","v":0},{"$f":"B7","v":0},{"$f":"D10","v":{"$error":"#VALUE!"}},{"$f":"K10","v":"*"},{"$f":"F10","v":{"$error":"#VALUE!"}},"Springerlink",{"$f":"B29","v":{"$error":"#VALUE!"}},"R. Ungaro, A. Pochini, G. D. Andreetti, Journal of Inclusion Phenomena and Macrocyclic Chemistry, 1984, 2 (39083), 199"]
["RE-EXPORT",{"$f":"REFSTORE!G2","v":0},{"$f":"VLOOKUP('J. Am. Chem. Soc.'!$H$4,REFSTORE!$C$6:$K$50000,2)","v":{"$error":"#N/A"}},{"$f":"VLOOKUP('J. Am. Chem. Soc.'!$H$4,REFSTORE!$C$6:$K$50000,3)","v":{"$error":"#N/A"}},{"$f":"VLOOKUP('J. Am. Chem. Soc.'!$H$4,REFSTORE!$C$6:$K$50000,4)","v":{"$error":"#N/A"}},{"$f":"VLOOKUP('J. Am. Chem. Soc.'!$H$4,REFSTORE!$C$6:$K$50000,5)","v":{"$error":"#N/A"}},{"$f":"VLOOKUP('J. Am. Chem. Soc.'!$H$4,REFSTORE!$C$6:$K$50000,6)","v":{"$error":"#N/A"}},{"$f":"VLOOKUP('J. Am. Chem. Soc.'!$H$4,REFSTORE!$C$6:$K$50000,7)","v":{"$error":"#N/A"}},{"$f":"VLOOKUP('J. Am. Chem. Soc.'!$H$4,REFSTORE!$C$6:$K$50000,8)","v":{"$error":"#N/A"}},{"$f":"VLOOKUP('J. Am. Chem. Soc.'!$H$4,REFSTORE!$C$6:$K$50000,9)","v":{"$error":"#N/A"}},"CONC",{"$f":"D38&\", \"&E38&\", \"&F38&\", \"&G38&\", \"&I38","v":{"$error":"#N/A"}}]
[null,null,null,null,null,null,null,null,null,null,"WIKI",{"$f":"\"<ref name=\"\"NAMEHERE\"\">\"&D38&\", ''\"&E38&\"'', \"&F38&\", '''\"&G38&\"''', \"&I38&\" {{DOI|\"&H38&\"}}</ref>\"","v":{"$error":"#N/A"}}]

{"sheet":"RSC","index":8,"n_rows":29,"n_cols":103,"rows_kept":29,"cut":false,"hidden":true,"merged":[]}
[]
[null,null,null,null,null,null,null,"ID","DATE","AUTHOR","JOURNAL","YEAR","VOLUME (No)","DOI","PAGE","IMPORT","WIKI","FORMATTED"]
[null,null,null,null,null,null,"EXPORT",null,{"$f":"TODAY()","v":"2011-03-18"},{"$f":"B4","v":0},{"$f":"B10","v":"*"},{"$f":"C10","v":"*"},{"$f":"D10","v":"*"},{"$f":"B6","v":0},{"$f":"F10","v":""},"RSC",{"$f":"B29","v":"<ref name=\"NAMEHERE\">''*'',*,''' ''',  {{DOI|*}}</ref>"},"*. *. *. *. *. *. *. *. *. *. *. *. *. *. *. *. *. *. *. *. *. *. *. *. *. *. *. *. *. *. *. *. *. *. *. *. *. *. *. *. *. *. *. *. *. *. *. *. *. *. *. *. *. *. *. *. *. *. *. *. *. *. *. *. *. *. *. *. *. *. *. *. *. *. *. *. *. *. *. *. *. *. *. *. *. *. *. *. *. *. *. *. *. *. *. *. *. *. *. *. *. *. *,*,*, *"]
["AUTHORS",null,null,null,null,null,"RE-EXPORT",{"$f":"REFSTORE!G2","v":0},{"$f":"VLOOKUP('J. Am. Chem. Soc.'!$H$4,REFSTORE!$C$6:$K$50000,2)","v":{"$error":"#N/A"}},{"$f":"VLOOKUP('J. Am. Chem. Soc.'!$H$4,REFSTORE!$C$6:$K$50000,3)","v":{"$error":"#N/A"}},{"$f":"VLOOKUP('J. Am. Chem. Soc.'!$H$4,REFSTORE!$C$6:$K$50000,4)","v":{"$error":"#N/A"}},{"$f":"VLOOKUP('J. Am. Chem. Soc.'!$H$4,REFSTORE!$C$6:$K$50000,5)","v":{"$error":"#N/A"}},{"$f":"VLOOKUP('J. Am. Chem. Soc.'!$H$4,REFSTORE!$C$6:$K$50000,6)","v":{"$error":"#N/A"}},{"$f":"VLOOKUP('J. Am. Chem. Soc.'!$H$4,REFSTORE!$C$6:$K$50000,7)","v":{"$error":"#N/A"}},{"$f":"VLOOKUP('J. Am. Chem. Soc.'!$H$4,REFSTORE!$C$6:$K$50000,8)","v":{"$error":"#N/A"}},{"$f":"VLOOKUP('J. Am. Chem. Soc.'!$H$4,REFSTORE!$C$6:$K$50000,9)","v":{"$error":"#N/A"}},"CONC",{"$f":"J4&\", \"&K4&\", \"&L4&\", \"&M4&\", \"&O4","v":{"$error":"#N/A"}}]
["JOURNAL",null,null,null,null,null,null,null,null,null,null,null,null,null,null,null,"WIKI",{"$f":"\"<ref name=\"\"NAMEHERE\"\">\"&J4&\", ''\"&K4&\"'', \"&L4&\", '''\"&M4&\"''', \"&O4&\" {{DOI|\"&N4&\"}}</ref>\"","v":{"$error":"#N/A"}}]
["CHECK DOI"]
[{"$f":"IF(myextract(B7,1,\"F\",\" \")=\"DOI:\",\"NOT OK\",\"OK\")","v":"OK"}]
[{"$f":"IF(myextract(B8,1,\"F\",\" \")=\"DOI:\",\"NOT OK\",\"OK\")","v":"OK"}]
[{"$f":"IF(myextract(B9,1,\"F\",\" \")=\"DOI:\",\"NOT OK\",\"OK\")","v":"OK"},null,"Year","Vol (no)","p/pp page","page","together",null,null,null,"DOI:"]
["Journal",{"$f":"myextract($B$5,1,\"F\",\",\")","v":"*"},{"$f":"myextract($B$5,2,\"F\",\",\")","v":"*"},{"$f":"myextract($B$5,3,\"F\",\",\")","v":"*"},{"$f":"((myextract($B$5,1,\"B\",\",\")))","v":"*"},{"$f":"E11","v":""},{"$f":"B10&\",\"&C10&\",\"&IF(E12=\"vol\",D10,H12)&\", \"&F10","v":"*,*, , "},null,null,null,{"$f":"myextract(B6,2,\"F\",\" \")","v":"*"}]
["len journal",{"$f":"LEN(B10)","v":1},null,"PAGE",{"$f":"MID(myextract(E10,1,\"F\",\"-\"),2,8)","v":""}]
[null,null,"Check if Vol",{"$f":"MID(myextract(B5,3,\"F\",\",\"),1,20)","v":"*"},{"$f":"IF(D12=E10,\"NO vol\",\"vol\")","v":"NO vol"},"INPUT VOL",null,{"$f":"\" \"&G12","v":" "}]
[]
["Authors",{"$f":"B4","v":0}]
["plus comma",{"$f":"B14&\",\"","v":"0,"},{"$f":"LEN(B10)+LEN(C10)","v":2}]
["Len string",{"$f":"LEN(B15)","v":2}]
["Count Term",1,2,3,4,5,6,7,8,9,10,11,12,13,14,15,16,17,18,19,20,21,22,23,24,25,26,27,28,29,30,31,32,33,34,35,36,37,38,39,40,41,42,43,44,45,46,47,48,49,50,51,52,53,54,55,56,57,58,59,60,61,62,63,64,65,66,67,68,69,70,71,72,73,74,75,76,77,78,79,80,81,82,83,84,85,86,87,88,89,90,91,92,93,94,95,96,97,98,99,100,101,102]
["Split Words",{"$f":"myextract($B$15,B17,\"F\",\" \")","v":"*"},{"$f":"myextract($B$15,C17,\"F\",\" \")","v":"*"},"*","*","*","*","*","*","*","*","*","*","*","*","*","*","*","*","*","*","*","*","*","*","*","*","*","*","*","*","*","*","*","*","*","*","*","*","*","*","*","*","*","*","*","*","*","*","*","*","*","*","*","*","*","*","*","*","*","*","*","*","*","*","*",{"$f":"myextract($B$15,BO17,\"F\",\" \")","v":"*"},"*","*","*","*","*","*","*","*","*","*","*","*","*","*","*","*","*","*","*","*","*","*","*","*","*","*","*","*","*","*","*","*","*","*","*","*"]
["Initialise",{"$f":"IF(RIGHT(B18,1)=\",\",B18,(LEFT(B18,1))&\".\")","v":"*."},{"$f":"IF(RIGHT(C18,1)=\",\",C18,(LEFT(C18,1))&\".\")","v":"*."},"*.","*.","*.","*.","*.","*.","*.","*.","*.","*.","*.","*.","*.","*.","*.","*.","*.","*.","*.","*.","*.","*.","*.","*.","*.","*.","*.","*.","*.","*.","*.","*.","*.","*.","*.","*.","*.","*.","*.","*.","*.","*.","*.","*.","*.","*.","*.","*.","*.","*.","*.","*.","*.","*.","*.","*.","*.","*.","*.","*.","*.","*.",{"$f":"IF(RIGHT(BN18,1)=\",\",BN18,(LEFT(BN18,1))&\".\")","v":"*."},"*.","*.","*.","*.","*.","*.","*.","*.","*.","*.","*.","*.","*.","*.","*.","*.","*.","*.","*.","*.","*.","*.","*.","*.","*.","*.","*.","*.","*.","*.","*.","*.","*.","*.","*.","*.","*."]
["Len",{"$f":"LEN(B19)","v":2},{"$f":"LEN(C19)","v":2},2,2,2,2,2,2,2,2,2,2,2,2,2,2,2,2,2,2,2,2,2,2,2,2,2,2,2,2,2,2,2,2,2,2,2,2,2,2,2,2,2,2,2,2,2,2,2,2,2,2,2,2,2,2,2,2,2,2,2,2,2,2,2,{"$f":"LEN(BO19)","v":2},2,2,2,2,2,2,2,2,2,2,2,2,2,2,2,2,2,2,2,2,2,2,2,2,2,2,2,2,2,2,2,2,2,2,2,2]
["Active?",{"$f":"IF(B20=0,\"\",IF(B20=$B$16,\"\",B19&\" \"))","v":""},{"$f":"IF(C20=0,\"\",IF(C20=$B$16,\"\",C19&\" \"))","v":""},"","","","","","","","","","","","","","","","","","","","","","","","","","","","","","","","","","","","","","","","","","","","","","","","","","","","","","","","","","","","","","","",{"$f":"IF(BO20=0,\"\",IF(BO20=$B$16,\"\",BO19&\" \"))","v":""},"","","","","","","","","","","","","","","","","","","","","","","","","","","","","","","","","","","",""]
["len authors+1",{"$f":"LEN(B23)+1","v":1},"Total",{"$f":"B22+C15+2","v":5}]
["Com Name",{"$f":"CONCATENATE(B21,C23)","v":""},{"$f":"CONCATENATE(C21,D23)","v":""},"","","","","","","","","","","","","","","","","","","","","","","","","","","","","","","","","","","","","","","","","","","","","","","","","","","","","","","","","","","","","","","",{"$f":"CONCATENATE(BO21,BP23)","v":""},"","","","","","","","","","","","","","","","","","","","","","","","","","","","","","","","","","","",""]
["Plus Journal",{"$f":"B23&G10","v":"*,*, , "}]
["Format"]
[]
[]
[]
["Wiki",{"$f":"\"<ref name=\"\"NAMEHERE\"\">\"&B23&\"''\"&B10&\"'',\"&C10&\",'''\"&IF(E12=\"vol\",D10,H12)&\"''', \"&F10&\" {{DOI|\"&K10&\"}}</ref>\"","v":"<ref name=\"NAMEHERE\">''*'',*,''' ''',  {{DOI|*}}</ref>"}]